{"text_format":"1","workbook":"xlsx","n_sheets":10,"sheets":["Protocol 1 (5nm)","Protocol 2 (native)","Protocol 3","Protocol TM30-20","Protocol Flicker","Protocol TLCI","Protocol PPFD","Reference Comparison","Data","Version 2.4 Base"],"not_rendered":{"charts":19,"images":17,"macros":1,"external_links":0,"defined_names":8,"comments":0,"pivot_tables":0},"unopened":[],"bounds":{"document_bytes":16777216,"sheet_cells":100000,"rows_first":2000,"rows_last":500,"rows_between":2000,"halvings":0,"cell_chars":16384,"cell_head_chars":4096},"cells_cut":0,"cells_raw":0,"read":"whole","date_system":"1900"}

{"sheet":"Protocol 1 (5nm)","index":0,"n_rows":58,"n_cols":94,"rows_kept":58,"cut":false,"hidden":false,"merged":[[3,84,3,99],[22,34,22,64],[23,34,23,64],[24,34,24,64],[26,34,26,64],[27,34,27,64],[29,34,29,64],[3,13,3,58],[30,86,30,98],[26,86,26,98],[22,86,22,98],[23,86,23,88],[24,86,24,88],[4,13,4,58],[5,13,5,58],[22,10,22,15],[23,10,23,15],[24,10,24,15],[24,65,24,81],[23,17,23,21],[23,22,23,23],[24,17,24,21],[27,89,27,90],[28,89,28,90],[57,0,57,14],[34,3,34,7],[34,8,34,9],[34,10,34,15],[35,3,35,7],[35,8,35,9],[35,10,35,15],[22,8,22,9],[23,8,23,9],[24,8,24,9],[25,8,25,9],[26,8,26,9],[27,8,27,9],[32,3,32,7],[32,8,32,9],[32,10,32,15],[29,3,29,7],[28,8,28,9],[28,10,28,15],[30,8,30,9],[30,3,30,7],[30,10,30,15],[29,8,29,9],[28,3,28,7],[45,78,45,85],[39,36,39,43],[47,72,47,77],[34,65,34,81],[35,34,35,64],[36,34,36,64],[34,34,34,64],[39,16,39,21],[39,22,39,29],[40,16,40,21],[44,36,44,43],[42,16,42,21],[42,22,42,29],[43,16,43,21],[39,44,39,49],[41,44,41,49],[39,50,39,57],[40,44,40,49],[43,30,43,35],[43,36,43,43],[47,22,47,29],[25,10,25,15],[26,10,26,15],[27,10,27,15],[31,86,31,88],[29,10,29,15],[22,65,22,81],[29,65,29,81],[22,17,22,21],[23,65,23,81],[24,22,24,23],[28,86,28,88],[31,89,31,90],[27,65,27,81],[23,89,23,90],[24,89,24,90],[28,17,29,31],[30,17,30,31],[26,65,26,81],[47,86,47,91],[47,92,47,99],[32,86,32,88],[46,50,46,57],[23,91,23,98],[24,91,24,98],[27,91,27,98],[28,91,28,98],[31,91,31,98],[32,91,32,98],[35,91,35,92],[35,93,35,98],[36,91,36,92],[36,93,36,98],[31,34,31,64],[32,34,32,64],[27,86,27,88],[50,86,50,91],[35,86,35,90],[40,58,40,63],[40,64,40,71],[41,58,41,63],[41,64,41,71],[42,86,42,91],[42,92,42,99],[43,86,43,91],[50,78,50,85],[49,72,49,77],[50,72,50,77],[46,58,46,63],[42,58,42,63],[42,64,42,71],[39,58,39,63],[39,64,39,71],[47,78,47,85],[43,72,43,77],[43,78,43,85],[44,72,44,77],[44,78,44,85],[45,92,45,99],[45,64,45,71],[51,86,51,91],[51,92,51,99],[36,65,36,81],[35,65,35,81],[31,65,31,81],[32,65,32,81],[39,72,39,77],[39,78,39,85],[40,72,40,77],[40,78,40,85],[41,72,41,77],[41,78,41,85],[42,72,42,77],[42,78,42,85],[48,72,48,77],[48,78,48,85],[41,86,41,91],[41,92,41,99],[34,86,34,98],[50,92,50,99],[46,86,46,91],[46,92,46,99],[32,89,32,90],[45,86,45,91],[43,92,43,99],[36,86,36,90],[46,72,46,77],[46,78,46,85],[43,50,43,57],[44,64,44,71],[46,2,46,7],[44,2,44,7],[45,8,45,15],[44,44,44,49],[40,2,40,7],[39,2,39,7],[41,2,41,7],[36,3,36,7],[42,2,42,7],[43,2,43,7],[36,8,36,9],[45,2,45,7],[42,8,42,15],[43,8,43,15],[44,8,44,15],[40,8,40,15],[41,8,41,15],[45,72,45,77],[49,30,49,35],[49,36,49,43],[45,30,45,35],[45,36,45,43],[48,44,48,49],[49,44,49,49],[45,44,45,49],[46,36,46,43],[47,30,47,35],[47,36,47,43],[47,44,47,49],[46,44,46,49],[48,36,48,43],[50,44,50,49],[45,50,45,57],[45,58,45,63],[47,50,47,57],[48,50,48,57],[49,50,49,57],[48,58,48,63],[48,64,48,71],[31,8,31,9],[31,10,31,15],[46,8,46,15],[40,50,40,57],[41,50,41,57],[39,30,39,35],[43,22,43,29],[40,22,40,29],[41,16,41,21],[43,58,43,63],[43,64,43,71],[44,58,44,63],[44,50,44,57],[43,44,43,49],[42,50,42,57],[42,36,42,43],[51,58,51,63],[51,64,51,71],[49,58,49,63],[49,64,49,71],[50,58,50,63],[50,64,50,71],[51,36,51,43],[50,22,50,29],[40,36,40,43],[41,30,41,35],[41,36,41,43],[40,30,40,35],[44,22,44,29],[48,22,48,29],[44,30,44,35],[51,44,51,49],[51,50,51,57],[41,22,41,29],[42,30,42,35],[48,30,48,35],[50,50,50,57],[46,64,46,71],[47,58,47,63],[47,64,47,71],[50,30,50,35],[50,8,50,15],[22,22,22,23],[26,3,26,7],[27,3,27,7],[23,3,23,7],[24,3,24,7],[25,3,25,7],[33,10,33,15],[39,8,39,15],[31,3,31,7],[48,16,48,21],[49,16,49,21],[49,22,49,29],[22,24,22,31],[23,24,23,31],[24,24,24,31],[26,17,26,21],[26,22,26,23],[26,24,26,31],[22,3,22,7],[36,10,36,15],[44,16,44,21],[46,30,46,35],[57,63,57,83],[57,84,57,101],[0,0,1,53],[49,86,49,91],[48,86,48,91],[49,92,49,99],[48,92,48,99],[40,92,40,99],[40,86,40,91],[39,92,39,99],[39,86,39,91],[44,92,44,99],[44,86,44,91],[57,15,57,26],[49,78,49,85],[4,84,4,99],[5,84,5,99],[3,62,3,83],[5,62,5,83],[45,16,45,21],[45,22,45,29],[46,16,46,21],[46,22,46,29],[49,2,49,7],[4,62,4,83],[3,0,3,12],[49,8,49,15],[42,44,42,49],[55,0,55,26],[50,36,50,43],[47,2,47,7],[50,16,50,21],[50,2,50,7],[47,16,47,21],[54,0,54,26],[53,0,53,26],[51,78,51,85],[33,3,33,7],[33,8,33,9],[48,8,48,15],[47,8,47,15],[51,72,51,77],[51,30,51,35],[51,8,51,15],[51,2,51,7],[51,16,51,21],[51,22,51,29],[48,2,48,7]]}
[{"$f":"IF(Data!$AE$2=\"DE\",\"Messprotokoll\",IF(Data!$AE$2=\"UK\",\"Measurement protocol\",IF(Data!$AE$2=\"FR\",\"Rapport de mesure\",\"Language Error\")))","v":"Measurement protocol"}]
[]
[]
[{"$f":"IF(Data!$AE$2 = \"DE\", \"Prüfling:\", IF(Data!$AE$2 = \"UK\",\"Test object:\",IF(Data!$AE$2=\"FR\",\"Objet testé:\",\"Language Error\")))","v":"Test object:"},null,null,null,null,null,null,null,null,null,null,null,null,{"$f":"IF(Data!$AE$2=\"DE\",\"Hersteller\",IF(Data!$AE$2=\"UK\",\"Manufacturer\",IF(Data!$AE$2=\"FR\",\"Fabricant\",\"Language Error\")))","v":"Manufacturer"},null,null,null,null,null,null,null,null,null,null,null,null,null,null,null,null,null,null,null,null,null,null,null,null,null,null,null,null,null,null,null,null,null,null,null,null,null,null,null,null,null,null,null,null,null,null,null,null,{"$f":"IF(Data!$AE$2=\"DE\",\"Messdatei:\",IF(Data!$AE$2=\"UK\",\"Measurement file:\",IF(Data!$AE$2=\"FR\",\"Fichier de mesure:\",\"Language Error\")))","v":"Measurement file:"},null,null,null,null,null,null,null,null,null,null,null,null,null,null,null,null,null,null,null,null,null,{"$f":"Data!Q18","v":"M_000003.CSV"}]
[null,null,null,null,null,null,null,null,null,null,null,null,null,{"$f":"IF(Data!$AE$2=\"DE\",\"Typ\",IF(Data!$AE$2=\"UK\",\"Type\",IF(Data!$AE$2=\"FR\",\"Type\",\"Language Error\")))","v":"Type"},null,null,null,null,null,null,null,null,null,null,null,null,null,null,null,null,null,null,null,null,null,null,null,null,null,null,null,null,null,null,null,null,null,null,null,null,null,null,null,null,null,null,null,null,null,null,null,null,{"$f":"IF(Data!$AE$2=\"DE\",\"Datum der Messung:\",IF(Data!$AE$2=\"UK\",\"Date of measurement:\",IF(Data!$AE$2=\"FR\",\"Date de mesure:\",\"Language Error\")))","v":"Date of measurement:"},null,null,null,null,null,null,null,null,null,null,null,null,null,null,null,null,null,null,null,null,null,{"$f":"Data!Q23","v":"29.04.2024"}]
[null,null,null,null,null,null,null,null,null,null,null,null,null,{"$f":"IF(Data!$AE$2=\"DE\",\"Modell\",IF(Data!$AE$2=\"UK\",\"Model\",IF(Data!$AE$2=\"FR\",\"Article\",\"Language Error\")))","v":"Model"},null,null,null,null,null,null,null,null,null,null,null,null,null,null,null,null,null,null,null,null,null,null,null,null,null,null,null,null,null,null,null,null,null,null,null,null,null,null,null,null,null,null,null,null,null,null,null,null,{"$f":"IF(Data!$AE$2=\"DE\",\"Uhrzeit der Messung:\",IF(Data!$AE$2=\"UK\",\"Time of measurement:\",IF(Data!$AE$2=\"FR\",\"Heure de mesure:\",\"Language Error\")))","v":"Time of measurement:"},null,null,null,null,null,null,null,null,null,null,null,null,null,null,null,null,null,null,null,null,null,{"$f":"Data!Q21","v":"08:07:17"}]
[]
[]
[]
[]
[]
[]
[]
[]
[]
[]
[]
[]
[]
[]
[]
[]
[null,null,null,"R1",null,null,null,null,"=",null,{"$f":"Data!K2","v":82.78},null,null,null,null,null,null,"Ra",null,null,null,null,"=",null,{"$f":"Data!K1","v":84.72},null,null,null,null,null,null,null,null,null,{"$f":"IF(Data!$AE$2=\"DE\",\"Beleuchtungsstärke\",IF(Data!$AE$2=\"UK\",\"Illuminance\",IF(Data!$AE$2=\"FR\",\"Illuminance\",\"Language Error\")))","v":"Illuminance"},null,null,null,null,null,null,null,null,null,null,null,null,null,null,null,null,null,null,null,null,null,null,null,null,null,null,null,null,null,null,{"$f":"Data!K33","v":3202.16},null,null,null,null,null,null,null,null,null,null,null,null,null,null,null,null,null,null,null,null,{"$f":"IF(CI24=\"x\",\"CIE1931\",IF(CI24=\"u'\",\"CIE1976\",IF(CI24=\"u\",\"CIE1960\",\"\")))","v":"CIE1931"}]
[null,null,null,"R2",null,null,null,null,"=",null,{"$f":"Data!K3","v":90.11},null,null,null,null,null,null,"Re",null,null,null,null,"=",null,{"$f":"Data!Q27","v":78.510000000000005},null,null,null,null,null,null,null,null,null,"Ee",null,null,null,null,null,null,null,null,null,null,null,null,null,null,null,null,null,null,null,null,null,null,null,null,null,null,null,null,null,null,{"$f":"Data!Q25","v":10.564},null,null,null,null,null,null,null,null,null,null,null,null,null,null,null,null,null,null,null,null,{"$f":"Data!J23","v":"x"},null,null,"=",null,{"$f":"Data!K23","v":0.38190000000000002}]
[null,null,null,"R3",null,null,null,null,"=",null,{"$f":"Data!K4","v":95.97},null,null,null,null,null,null,"GAI",null,null,null,null,"=",null,{"$f":"Data!Q28","v":70.459999999999994},null,null,null,null,null,null,null,null,null,"LER",null,null,null,null,null,null,null,null,null,null,null,null,null,null,null,null,null,null,null,null,null,null,null,null,null,null,null,null,null,null,{"$f":"Data!Q26","v":303.10000000000002},null,null,null,null,null,null,null,null,null,null,null,null,null,null,null,null,null,null,null,null,{"$f":"Data!J24","v":"y"},null,null,"=",null,{"$f":"Data!K24","v":0.38419999999999999}]
[null,null,null,"R4",null,null,null,null,"=",null,{"$f":"Data!K5","v":83.5}]
[null,null,null,"R5",null,null,null,null,"=",null,{"$f":"Data!K6","v":82.71},null,null,null,null,null,null,"TLCI",null,null,null,null,"=",null,{"$f":"Data!Q30","v":75},null,null,null,null,null,null,null,null,null,{"$f":"IF(Data!$AE$2 = \"DE\", \"Ähnlichste Farbtemperatur (CCT)\", IF(Data!$AE$2 = \"UK\",\"Correlated Color Temperature (CCT)\",IF(Data!$AE$2=\"FR\",\"Temp. de couleur proximale (CCT)\",\"Language Error\")))","v":"Correlated Color Temperature (CCT)"},null,null,null,null,null,null,null,null,null,null,null,null,null,null,null,null,null,null,null,null,null,null,null,null,null,null,null,null,null,null,{"$f":"Data!K30","v":4014},null,null,null,null,null,null,null,null,null,null,null,null,null,null,null,null,null,null,null,null,{"$f":"IF(CI28=\"x\",\"CIE1931\",IF(CI28=\"u'\",\"CIE1976\",IF(CI28=\"u\",\"CIE1960\",\"\")))","v":"CIE1976"}]
[null,null,null,"R6",null,null,null,null,"=",null,{"$f":"Data!K7","v":86.5},null,null,null,null,null,null,null,null,null,null,null,null,null,null,null,null,null,null,null,null,null,null,null,"Duv",null,null,null,null,null,null,null,null,null,null,null,null,null,null,null,null,null,null,null,null,null,null,null,null,null,null,null,null,null,null,{"$f":"Data!K31","v":3.0000000000000001E-3},null,null,null,null,null,null,null,null,null,null,null,null,null,null,null,null,null,null,null,null,{"$f":"Data!J25","v":"u'"},null,null,"=",null,{"$f":"Data!K25","v":0.22309999999999999}]
[null,null,null,"R7",null,null,null,null,"=",null,{"$f":"Data!K8","v":88.13},null,null,null,null,null,null,"PPFD\n[µmol/m²s]",null,null,null,null,null,null,null,null,null,null,null,null,null,null,null,null,null,null,null,null,null,null,null,null,null,null,null,null,null,null,null,null,null,null,null,null,null,null,null,null,null,null,null,null,null,null,null,null,null,null,null,null,null,null,null,null,null,null,null,null,null,null,null,null,null,null,null,null,{"$f":"Data!J26","v":"v'"},null,null,"=",null,{"$f":"Data!K26","v":0.505}]
[null,null,null,"R8",null,null,null,null,"=",null,{"$f":"Data!K9","v":68.09},null,null,null,null,null,null,null,null,null,null,null,null,null,null,null,null,null,null,null,null,null,null,null,{"$f":"IF(Data!$AE$2 = \"DE\", \"Farbreinheit\",IF(Data!$AE$2 = \"UK\",\"Saturation\",IF(Data!$AE$2=\"FR\",\"Saturation\",\"Language Error\")))","v":"Saturation"},null,null,null,null,null,null,null,null,null,null,null,null,null,null,null,null,null,null,null,null,null,null,null,null,null,null,null,null,null,null,{"$f":"Data!K39","v":29.9}]
[null,null,null,"R9",null,null,null,null,"=",null,{"$f":"Data!K10","v":17.21},null,null,null,null,null,null,{"$f":"Data!K158","v":45.52},null,null,null,null,null,null,null,null,null,null,null,null,null,null,null,null,null,null,null,null,null,null,null,null,null,null,null,null,null,null,null,null,null,null,null,null,null,null,null,null,null,null,null,null,null,null,null,null,null,null,null,null,null,null,null,null,null,null,null,null,null,null,null,null,null,null,null,null,{"$f":"IF(CI32=\"x\",\"CIE1931\",IF(CI32=\"u'\",\"CIE1976\",IF(CI32=\"u\",\"CIE1960\",\"\")))","v":"CIE1960"}]
[null,null,null,"R10",null,null,null,null,"=",null,{"$f":"Data!K11","v":76.650000000000006},null,null,null,null,null,null,null,null,null,null,null,null,null,null,null,null,null,null,null,null,null,null,null,{"$f":"IF(Data!$AE$2 = \"DE\", \"Dominante Wellenlänge\", IF(Data!$AE$2 = \"UK\", \"Dominant wavelength\",IF(Data!$AE$2=\"FR\",\"Longueur d'onde dominante (λD)\",\"Language Error\")))","v":"Dominant wavelength"},null,null,null,null,null,null,null,null,null,null,null,null,null,null,null,null,null,null,null,null,null,null,null,null,null,null,null,null,null,null,{"$f":"Data!K40 & \" nm\"","v":"577 nm"},null,null,null,null,null,null,null,null,null,null,null,null,null,null,null,null,null,null,null,null,{"$f":"Data!J27","v":"u"},null,null,"=",null,{"$f":"Data!K27","v":0.22309999999999999}]
[null,null,null,"R11",null,null,null,null,"=",null,{"$f":"Data!K12","v":82.47},null,null,null,null,null,null,null,null,null,null,null,null,null,null,null,null,null,null,null,null,null,null,null,{"$f":"IF(Data!$AE$2 = \"DE\", \"Peak-Wellenlänge\",IF(Data!$AE$2 = \"UK\", \"Peak wavelength\",IF(Data!$AE$2=\"FR\",\"Pic courbe spectrale (λP)\",\"Language Error\")))","v":"Peak wavelength"},null,null,null,null,null,null,null,null,null,null,null,null,null,null,null,null,null,null,null,null,null,null,null,null,null,null,null,null,null,null,{"$f":"Data!K20 & \" nm\"","v":"595 nm"},null,null,null,null,null,null,null,null,null,null,null,null,null,null,null,null,null,null,null,null,{"$f":"Data!J28","v":"v"},null,null,"=",null,{"$f":"Data!K28","v":0.3367}]
[null,null,null,"R12",null,null,null,null,"=",null,{"$f":"Data!K13","v":64.47}]
[null,null,null,"R13",null,null,null,null,"=",null,{"$f":"Data!K14","v":84.59},null,null,null,null,null,null,null,null,null,null,null,null,null,null,null,null,null,null,null,null,null,null,null,{"$f":"IF(Data!$AE$2 = \"DE\", \"Flickerfrequenz\", IF(Data!$AE$2 = \"UK\",\"Flicker frequency\",IF(Data!$AE$2=\"FR\",\"Fréquence flicker\",\"Language Error\")))","v":"Flicker frequency"},null,null,null,null,null,null,null,null,null,null,null,null,null,null,null,null,null,null,null,null,null,null,null,null,null,null,null,null,null,null,{"$f":"Data!K36","v":99.9},null,null,null,null,null,null,null,null,null,null,null,null,null,null,null,null,null,null,null,null,"TM30"]
[null,null,null,"R14",null,null,null,null,"=",null,{"$f":"Data!K15","v":97.9},null,null,null,null,null,null,null,null,null,null,null,null,null,null,null,null,null,null,null,null,null,null,null,{"$f":"IF(Data!$AE$2 = \"DE\", \"Prozent Flicker\", IF(Data!$AE$2 = \"UK\",\"Percent Flicker\",IF(Data!$AE$2=\"FR\",\"% flicker\",\"Language Error\")))","v":"Percent Flicker"},null,null,null,null,null,null,null,null,null,null,null,null,null,null,null,null,null,null,null,null,null,null,null,null,null,null,null,null,null,null,{"$f":"Data!K37","v":17.2},null,null,null,null,null,null,null,null,null,null,null,null,null,null,null,null,null,null,null,null,"Rf",null,null,null,null,"=",null,{"$f":"Data!K43","v":86.1}]
[null,null,null,"R15",null,null,null,null,"=",null,{"$f":"Data!K16","v":76.53},null,null,null,null,null,null,null,null,null,null,null,null,null,null,null,null,null,null,null,null,null,null,null,{"$f":"IF(Data!$AE$2 = \"DE\", \"Flickerindex\", IF(Data!$AE$2 = \"UK\",\"Flicker index\",IF(Data!$AE$2=\"FR\",\"Index flicker\",\"Language Error\")))","v":"Flicker index"},null,null,null,null,null,null,null,null,null,null,null,null,null,null,null,null,null,null,null,null,null,null,null,null,null,null,null,null,null,null,{"$f":"Data!K35","v":5.0999999999999997E-2},null,null,null,null,null,null,null,null,null,null,null,null,null,null,null,null,null,null,null,null,"Rg",null,null,null,null,"=",null,{"$f":"Data!K44","v":95.2}]
[]
[]
[null,null,"[nm]",null,null,null,null,null,"mW/m²/nm",null,null,null,null,null,null,null,"[nm]",null,null,null,null,null,"mW/m²/nm",null,null,null,null,null,null,null,"[nm]",null,null,null,null,null,"mW/m²/nm",null,null,null,null,null,null,null,"[nm]",null,null,null,null,null,"mW/m²/nm",null,null,null,null,null,null,null,"[nm]",null,null,null,null,null,"mW/m²/nm",null,null,null,null,null,null,null,"[nm]",null,null,null,null,null,"mW/m²/nm",null,null,null,null,null,null,null,"[nm]",null,null,null,null,null,"mW/m²/nm"]
[null,null,{"$f":"Data!G1","v":380},null,null,null,null,null,{"$f":"Data!H1","v":0.68384},null,null,null,null,null,null,null,{"$f":"Data!G13","v":440},null,null,null,null,null,{"$f":"Data!H13","v":23.31664},null,null,null,null,null,null,null,{"$f":"Data!G25","v":500},null,null,null,null,null,{"$f":"Data!H25","v":27.90953},null,null,null,null,null,null,null,{"$f":"Data!G37","v":560},null,null,null,null,null,{"$f":"Data!H37","v":47.049399999999999},null,null,null,null,null,null,null,{"$f":"Data!G49","v":620},null,null,null,null,null,{"$f":"Data!H49","v":47.248339999999999},null,null,null,null,null,null,null,{"$f":"Data!G61","v":680},null,null,null,null,null,{"$f":"Data!H61","v":17.91291},null,null,null,null,null,null,null,{"$f":"Data!G73","v":740},null,null,null,null,null,{"$f":"Data!H73","v":11.0448}]
[null,null,{"$f":"Data!G2","v":385},null,null,null,null,null,{"$f":"Data!H2","v":0.74607000000000001},null,null,null,null,null,null,null,{"$f":"Data!G14","v":445},null,null,null,null,null,{"$f":"Data!H14","v":38.419719999999998},null,null,null,null,null,null,null,{"$f":"Data!G26","v":505},null,null,null,null,null,{"$f":"Data!H26","v":31.271339999999999},null,null,null,null,null,null,null,{"$f":"Data!G38","v":565},null,null,null,null,null,{"$f":"Data!H38","v":48.187980000000003},null,null,null,null,null,null,null,{"$f":"Data!G50","v":625},null,null,null,null,null,{"$f":"Data!H50","v":44.708779999999997},null,null,null,null,null,null,null,{"$f":"Data!G62","v":685},null,null,null,null,null,{"$f":"Data!H62","v":16.05528},null,null,null,null,null,null,null,{"$f":"Data!G74","v":745},null,null,null,null,null,{"$f":"Data!H74","v":11.26281}]
[null,null,{"$f":"Data!G3","v":390},null,null,null,null,null,{"$f":"Data!H3","v":0.91386999999999996},null,null,null,null,null,null,null,{"$f":"Data!G15","v":450},null,null,null,null,null,{"$f":"Data!H15","v":50.485010000000003},null,null,null,null,null,null,null,{"$f":"Data!G27","v":510},null,null,null,null,null,{"$f":"Data!H27","v":33.841369999999998},null,null,null,null,null,null,null,{"$f":"Data!G39","v":570},null,null,null,null,null,{"$f":"Data!H39","v":49.69511},null,null,null,null,null,null,null,{"$f":"Data!G51","v":630},null,null,null,null,null,{"$f":"Data!H51","v":41.866079999999997},null,null,null,null,null,null,null,{"$f":"Data!G63","v":690},null,null,null,null,null,{"$f":"Data!H63","v":14.52068},null,null,null,null,null,null,null,{"$f":"Data!G75","v":750},null,null,null,null,null,{"$f":"Data!H75","v":11.173349999999999}]
[null,null,{"$f":"Data!G4","v":395},null,null,null,null,null,{"$f":"Data!H4","v":1.2555099999999999},null,null,null,null,null,null,null,{"$f":"Data!G16","v":455},null,null,null,null,null,{"$f":"Data!H16","v":48.125909999999998},null,null,null,null,null,null,null,{"$f":"Data!G28","v":515},null,null,null,null,null,{"$f":"Data!H28","v":35.920009999999998},null,null,null,null,null,null,null,{"$f":"Data!G40","v":575},null,null,null,null,null,{"$f":"Data!H40","v":51.013109999999998},null,null,null,null,null,null,null,{"$f":"Data!G52","v":635},null,null,null,null,null,{"$f":"Data!H52","v":39.115130000000001},null,null,null,null,null,null,null,{"$f":"Data!G64","v":695},null,null,null,null,null,{"$f":"Data!H64","v":13.57545},null,null,null,null,null,null,null,{"$f":"Data!G76","v":755},null,null,null,null,null,{"$f":"Data!H76","v":9.8014100000000006}]
[null,null,{"$f":"Data!G5","v":400},null,null,null,null,null,{"$f":"Data!H5","v":1.8004599999999999},null,null,null,null,null,null,null,{"$f":"Data!G17","v":460},null,null,null,null,null,{"$f":"Data!H17","v":37.257539999999999},null,null,null,null,null,null,null,{"$f":"Data!G29","v":520},null,null,null,null,null,{"$f":"Data!H29","v":37.57893},null,null,null,null,null,null,null,{"$f":"Data!G41","v":580},null,null,null,null,null,{"$f":"Data!H41","v":52.255859999999998},null,null,null,null,null,null,null,{"$f":"Data!G53","v":640},null,null,null,null,null,{"$f":"Data!H53","v":36.297190000000001},null,null,null,null,null,null,null,{"$f":"Data!G65","v":700},null,null,null,null,null,{"$f":"Data!H65","v":13.04884},null,null,null,null,null,null,null,{"$f":"Data!G77","v":760},null,null,null,null,null,{"$f":"Data!H77","v":7.5748499999999996}]
[null,null,{"$f":"Data!G6","v":405},null,null,null,null,null,{"$f":"Data!H6","v":2.1574399999999998},null,null,null,null,null,null,null,{"$f":"Data!G18","v":465},null,null,null,null,null,{"$f":"Data!H18","v":29.61403},null,null,null,null,null,null,null,{"$f":"Data!G30","v":525},null,null,null,null,null,{"$f":"Data!H30","v":38.95928},null,null,null,null,null,null,null,{"$f":"Data!G42","v":585},null,null,null,null,null,{"$f":"Data!H42","v":53.208840000000002},null,null,null,null,null,null,null,{"$f":"Data!G54","v":645},null,null,null,null,null,{"$f":"Data!H54","v":33.354109999999999},null,null,null,null,null,null,null,{"$f":"Data!G66","v":705},null,null,null,null,null,{"$f":"Data!H66","v":12.820119999999999},null,null,null,null,null,null,null,{"$f":"Data!G78","v":765},null,null,null,null,null,{"$f":"Data!H78","v":7.42204}]
[null,null,{"$f":"Data!G7","v":410},null,null,null,null,null,{"$f":"Data!H7","v":2.7395700000000001},null,null,null,null,null,null,null,{"$f":"Data!G19","v":470},null,null,null,null,null,{"$f":"Data!H19","v":24.335519999999999},null,null,null,null,null,null,null,{"$f":"Data!G31","v":530},null,null,null,null,null,{"$f":"Data!H31","v":40.104469999999999},null,null,null,null,null,null,null,{"$f":"Data!G43","v":590},null,null,null,null,null,{"$f":"Data!H43","v":53.498269999999998},null,null,null,null,null,null,null,{"$f":"Data!G55","v":650},null,null,null,null,null,{"$f":"Data!H55","v":30.468530000000001},null,null,null,null,null,null,null,{"$f":"Data!G67","v":710},null,null,null,null,null,{"$f":"Data!H67","v":12.3506},null,null,null,null,null,null,null,{"$f":"Data!G79","v":770},null,null,null,null,null,{"$f":"Data!H79","v":9.3577700000000004}]
[null,null,{"$f":"Data!G8","v":415},null,null,null,null,null,{"$f":"Data!H8","v":3.6223900000000002},null,null,null,null,null,null,null,{"$f":"Data!G20","v":475},null,null,null,null,null,{"$f":"Data!H20","v":20.106950000000001},null,null,null,null,null,null,null,{"$f":"Data!G32","v":535},null,null,null,null,null,{"$f":"Data!H32","v":41.304229999999997},null,null,null,null,null,null,null,{"$f":"Data!G44","v":595},null,null,null,null,null,{"$f":"Data!H44","v":53.85181},null,null,null,null,null,null,null,{"$f":"Data!G56","v":655},null,null,null,null,null,{"$f":"Data!H56","v":27.645689999999998},null,null,null,null,null,null,null,{"$f":"Data!G68","v":715},null,null,null,null,null,{"$f":"Data!H68","v":11.118410000000001},null,null,null,null,null,null,null,{"$f":"Data!G80","v":775},null,null,null,null,null,{"$f":"Data!H80","v":10.22785}]
[null,null,{"$f":"Data!G9","v":420},null,null,null,null,null,{"$f":"Data!H9","v":4.6374399999999998},null,null,null,null,null,null,null,{"$f":"Data!G21","v":480},null,null,null,null,null,{"$f":"Data!H21","v":18.811810000000001},null,null,null,null,null,null,null,{"$f":"Data!G33","v":540},null,null,null,null,null,{"$f":"Data!H33","v":42.239730000000002},null,null,null,null,null,null,null,{"$f":"Data!G45","v":600},null,null,null,null,null,{"$f":"Data!H45","v":53.785820000000001},null,null,null,null,null,null,null,{"$f":"Data!G57","v":660},null,null,null,null,null,{"$f":"Data!H57","v":25.30733},null,null,null,null,null,null,null,{"$f":"Data!G69","v":720},null,null,null,null,null,{"$f":"Data!H69","v":10.232659999999999},null,null,null,null,null,null,null,{"$f":"Data!G81","v":780},null,null,null,null,null,{"$f":"Data!H81","v":10.4739}]
[null,null,{"$f":"Data!G10","v":425},null,null,null,null,null,{"$f":"Data!H10","v":6.1680599999999997},null,null,null,null,null,null,null,{"$f":"Data!G22","v":485},null,null,null,null,null,{"$f":"Data!H22","v":19.296890000000001},null,null,null,null,null,null,null,{"$f":"Data!G34","v":545},null,null,null,null,null,{"$f":"Data!H34","v":43.382800000000003},null,null,null,null,null,null,null,{"$f":"Data!G46","v":605},null,null,null,null,null,{"$f":"Data!H46","v":52.931550000000001},null,null,null,null,null,null,null,{"$f":"Data!G58","v":665},null,null,null,null,null,{"$f":"Data!H58","v":23.26774},null,null,null,null,null,null,null,{"$f":"Data!G70","v":725},null,null,null,null,null,{"$f":"Data!H70","v":9.8008000000000006}]
[null,null,{"$f":"Data!G11","v":430},null,null,null,null,null,{"$f":"Data!H11","v":8.7164999999999999},null,null,null,null,null,null,null,{"$f":"Data!G23","v":490},null,null,null,null,null,{"$f":"Data!H23","v":21.250699999999998},null,null,null,null,null,null,null,{"$f":"Data!G35","v":550},null,null,null,null,null,{"$f":"Data!H35","v":44.504919999999998},null,null,null,null,null,null,null,{"$f":"Data!G47","v":610},null,null,null,null,null,{"$f":"Data!H47","v":51.470959999999998},null,null,null,null,null,null,null,{"$f":"Data!G59","v":670},null,null,null,null,null,{"$f":"Data!H59","v":21.508050000000001},null,null,null,null,null,null,null,{"$f":"Data!G71","v":730},null,null,null,null,null,{"$f":"Data!H71","v":10.161989999999999}]
[null,null,{"$f":"Data!G12","v":435},null,null,null,null,null,{"$f":"Data!H12","v":13.82133},null,null,null,null,null,null,null,{"$f":"Data!G24","v":495},null,null,null,null,null,{"$f":"Data!H24","v":24.390899999999998},null,null,null,null,null,null,null,{"$f":"Data!G36","v":555},null,null,null,null,null,{"$f":"Data!H36","v":45.709710000000001},null,null,null,null,null,null,null,{"$f":"Data!G48","v":615},null,null,null,null,null,{"$f":"Data!H48","v":49.462730000000001},null,null,null,null,null,null,null,{"$f":"Data!G60","v":675},null,null,null,null,null,{"$f":"Data!H60","v":19.688700000000001},null,null,null,null,null,null,null,{"$f":"Data!G72","v":735},null,null,null,null,null,{"$f":"Data!H72","v":10.65001}]
[]
[{"$f":"IF(Data!$AE$2=\"DE\",\"Firma\",IF(Data!$AE$2=\"UK\",\"Company\",IF(Data!$AE$2=\"FR\",\"Société\",\"Language Error\")))","v":"Company"}]
[{"$f":"IF(Data!$AE$2=\"DE\",\"Adresse\",IF(Data!$AE$2=\"UK\",\"Address\",IF(Data!$AE$2=\"FR\",\"Adresse\",\"Language Error\")))","v":"Address"}]
[{"$f":"IF(Data!$AE$2=\"DE\",\"PLZ  Ort\",IF(Data!$AE$2=\"UK\",\"ZIP  City\",IF(Data!$AE$2=\"FR\",\"Code postal Ville\",\"Language Error\")))","v":"ZIP  City"}]
[]
[{"$f":"IF(Data!$AE$2=\"DE\",\"Prüfort,\",IF(Data!$AE$2=\"UK\",\"Test location,\",IF(Data!$AE$2=\"FR\",\"Lieu de rapport, \",\"Language Error\")))","v":"Test location,"},null,null,null,null,null,null,null,null,null,null,null,null,null,null,{"$f":"IF(Data!$AE$2=\"DE\",\"Datum\",IF(Data!$AE$2=\"UK\",\"Date\",IF(Data!$AE$2=\"FR\",\"Date\",\"Language Error\")))","v":"Date"},null,null,null,null,null,null,null,null,null,null,null,null,null,null,null,null,null,null,null,null,null,null,null,null,null,null,null,null,null,null,null,null,null,null,null,null,null,null,null,null,null,null,null,null,null,null,null,{"$f":"IF(Data!$AE$2=\"DE\",\"Vorname, Nachname Prüfer\",IF(Data!$AE$2=\"UK\",\"First, last name of inspector\",IF(Data!$AE$2=\"FR\",\"Prénom Nom du testeur\",\"Language Error\")))","v":"First, last name of inspector"},null,null,null,null,null,null,null,null,null,null,null,null,null,null,null,null,null,null,null,null,{"$f":"IF(Data!$AE$2=\"DE\",\"Telefonnummer\",IF(Data!$AE$2=\"UK\",\"Phone number\",IF(Data!$AE$2=\"FR\",\"N° téléphone\",\"Language Error\")))","v":"Phone number"}]

{"sheet":"Protocol 2 (native)","index":1,"n_rows":68,"n_cols":91,"rows_kept":68,"cut":false,"hidden":false,"merged":[[5,84,5,99],[51,85,51,89],[51,90,51,98],[52,85,52,89],[52,90,52,98],[46,85,46,89],[46,90,46,98],[47,85,47,89],[47,90,47,98],[48,85,48,89],[48,90,48,98],[49,85,49,89],[49,90,49,98],[50,85,50,89],[50,90,50,98],[41,85,41,89],[41,90,41,98],[42,85,42,89],[42,90,42,98],[36,85,36,89],[36,90,36,98],[37,85,37,89],[37,90,37,98],[38,85,38,89],[31,85,31,89],[31,90,31,98],[32,85,32,89],[32,90,32,98],[33,85,33,89],[33,90,33,98],[34,85,34,89],[34,90,34,98],[35,85,35,89],[35,90,35,98],[26,85,26,89],[26,90,26,98],[27,85,27,89],[27,90,27,98],[28,85,28,89],[28,90,28,98],[29,85,29,89],[29,90,29,98],[30,85,30,89],[30,90,30,98],[21,85,21,89],[21,90,21,98],[22,85,22,89],[22,90,22,98],[23,85,23,89],[23,90,23,98],[24,85,24,89],[24,90,24,98],[25,85,25,89],[25,90,25,98],[21,71,21,75],[21,76,21,84],[22,71,22,75],[22,76,22,84],[23,71,23,75],[23,76,23,84],[24,71,24,75],[24,76,24,84],[25,71,25,75],[25,76,25,84],[40,57,40,61],[40,62,40,70],[41,57,41,61],[41,62,41,70],[42,57,42,61],[42,62,42,70],[43,57,43,61],[43,62,43,70],[44,57,44,61],[44,62,44,70],[51,43,51,47],[51,48,51,56],[52,43,52,47],[52,48,52,56],[21,57,21,61],[21,62,21,70],[22,57,22,61],[22,62,22,70],[23,57,23,61],[23,62,23,70],[24,57,24,61],[24,62,24,70],[25,57,25,61],[25,62,25,70],[26,57,26,61],[26,62,26,70],[27,57,27,61],[27,62,27,70],[28,57,28,61],[28,62,28,70],[29,57,29,61],[29,62,29,70],[30,57,30,61],[30,62,30,70],[46,43,46,47],[46,48,46,56],[47,43,47,47],[47,48,47,56],[48,43,48,47],[48,48,48,56],[49,43,49,47],[49,48,49,56],[50,43,50,47],[50,48,50,56],[41,43,41,47],[41,48,41,56],[42,43,42,47],[42,48,42,56],[43,43,43,47],[43,48,43,56],[44,43,44,47],[44,48,44,56],[45,43,45,47],[45,48,45,56],[36,43,36,47],[36,48,36,56],[37,43,37,47],[37,48,37,56],[38,43,38,47],[38,48,38,56],[39,43,39,47],[39,48,39,56],[40,43,40,47],[40,48,40,56],[31,43,31,47],[32,43,32,47],[32,48,32,56],[33,43,33,47],[33,48,33,56],[34,43,34,47],[34,48,34,56],[35,43,35,47],[35,48,35,56],[31,48,31,56],[50,34,50,42],[51,34,51,42],[52,29,52,33],[52,34,52,42],[21,43,21,47],[21,48,21,56],[22,43,22,47],[22,48,22,56],[23,43,23,47],[23,48,23,56],[24,43,24,47],[24,48,24,56],[25,43,25,47],[25,48,25,56],[26,43,26,47],[26,48,26,56],[27,43,27,47],[27,48,27,56],[28,43,28,47],[28,48,28,56],[29,43,29,47],[29,48,29,56],[30,43,30,47],[30,48,30,56],[44,34,44,42],[45,29,45,33],[45,34,45,42],[46,34,46,42],[47,29,47,33],[47,34,47,42],[48,29,48,33],[48,34,48,42],[49,29,49,33],[49,34,49,42],[38,34,38,42],[39,29,39,33],[39,34,39,42],[40,29,40,33],[40,34,40,42],[41,34,41,42],[42,29,42,33],[42,34,42,42],[43,29,43,33],[43,34,43,42],[32,34,32,42],[33,29,33,33],[33,34,33,42],[34,29,34,33],[34,34,34,42],[35,29,35,33],[35,34,35,42],[36,34,36,42],[37,29,37,33],[37,34,37,42],[26,34,26,42],[27,29,27,33],[27,34,27,42],[28,29,28,33],[28,34,28,42],[29,29,29,33],[29,34,29,42],[30,29,30,33],[30,34,30,42],[26,29,26,33],[21,34,21,42],[22,29,22,33],[22,34,22,42],[23,29,23,33],[23,34,23,42],[24,29,24,33],[24,34,24,42],[25,29,25,33],[25,34,25,42],[21,29,21,33],[31,29,31,33],[36,29,36,33],[41,29,41,33],[46,29,46,33],[51,29,51,33],[44,15,44,19],[44,20,44,28],[45,15,45,19],[45,20,45,28],[46,15,46,19],[46,20,46,28],[47,15,47,19],[47,20,47,28],[48,15,48,19],[38,29,38,33],[44,29,44,33],[50,29,50,33],[43,15,43,19],[43,20,43,28],[49,15,49,19],[49,20,49,28],[50,15,50,19],[50,20,50,28],[51,15,51,19],[51,20,51,28],[52,15,52,19],[52,20,52,28],[21,15,21,19],[21,20,21,28],[22,15,22,19],[22,20,22,28],[23,15,23,19],[23,20,23,28],[24,15,24,19],[24,20,24,28],[25,15,25,19],[25,20,25,28],[26,15,26,19],[26,20,26,28],[42,15,42,19],[42,20,42,28],[30,15,30,19],[30,20,30,28],[31,15,31,19],[31,20,31,28],[32,15,32,19],[32,20,32,28],[33,15,33,19],[47,1,47,5],[48,1,48,5],[49,1,49,5],[50,1,50,5],[51,1,51,5],[52,1,52,5],[21,6,21,14],[22,6,22,14],[23,6,23,14],[24,6,24,14],[25,6,25,14],[26,6,26,14],[27,6,27,14],[28,6,28,14],[29,6,29,14],[30,6,30,14],[31,6,31,14],[32,6,32,14],[33,6,33,14],[34,6,34,14],[35,6,35,14],[36,6,36,14],[37,6,37,14],[38,6,38,14],[22,1,22,5],[21,1,21,5],[23,1,23,5],[24,1,24,5],[25,1,25,5],[26,1,26,5],[27,1,27,5],[28,1,28,5],[29,1,29,5],[47,6,47,14],[48,6,48,14],[49,6,49,14],[50,6,50,14],[51,6,51,14],[52,6,52,14],[27,15,27,19],[27,20,27,28],[28,15,28,19],[28,20,28,28],[29,15,29,19],[29,20,29,28],[39,6,39,14],[40,6,40,14],[41,6,41,14],[42,6,42,14],[43,6,43,14],[48,20,48,28],[39,15,39,19],[39,20,39,28],[40,15,40,19],[40,20,40,28],[41,15,41,19],[41,20,41,28],[39,1,39,5],[40,1,40,5],[41,1,41,5],[42,1,42,5],[44,6,44,14],[45,6,45,14],[46,6,46,14],[30,1,30,5],[31,1,31,5],[32,1,32,5],[33,1,33,5],[34,1,34,5],[35,1,35,5],[36,1,36,5],[37,1,37,5],[38,1,38,5],[43,1,43,5],[44,1,44,5],[45,1,45,5],[46,1,46,5],[53,135,53,140],[32,155,32,160],[42,161,42,164],[42,165,42,170],[33,115,33,120],[22,115,22,120],[22,155,22,160],[29,121,29,124],[25,121,25,124],[26,121,26,124],[27,115,27,120],[28,115,28,120],[29,115,29,120],[37,121,37,124],[38,121,38,124],[39,121,39,124],[24,115,24,120],[25,115,25,120],[26,115,26,120],[34,121,34,124],[33,155,33,160],[34,155,34,160],[23,145,23,150],[24,145,24,150],[22,161,22,164],[22,165,22,170],[22,135,22,140],[22,145,22,150],[22,151,22,154],[36,115,36,120],[42,115,42,120],[48,115,48,120],[42,125,42,130],[33,125,33,130],[25,125,25,130],[30,115,30,120],[31,115,31,120],[35,115,35,120],[34,115,34,120],[36,155,36,160],[37,155,37,160],[38,155,38,160],[47,115,47,120],[46,115,46,120],[45,115,45,120],[44,115,44,120],[43,115,43,120],[48,135,48,140],[38,115,38,120],[48,155,48,160],[49,155,49,160],[50,155,50,160],[47,155,47,160],[42,151,42,154],[39,151,39,154],[44,125,44,130],[45,125,45,130],[40,135,40,140],[41,135,41,140],[44,135,44,140],[45,135,45,140],[46,141,46,144],[43,135,43,140],[41,131,41,134],[47,125,47,130],[48,121,48,124],[48,125,48,130],[41,125,41,130],[43,151,43,154],[44,151,44,154],[45,151,45,154],[46,151,46,154],[37,151,37,154],[40,151,40,154],[41,151,41,154],[45,155,45,160],[46,155,46,160],[40,155,40,160],[41,155,41,160],[38,151,38,154],[50,135,50,140],[47,135,47,140],[38,141,38,144],[39,141,39,144],[40,141,40,144],[47,151,47,154],[44,145,44,150],[45,145,45,150],[46,145,46,150],[47,145,47,150],[48,145,48,150],[49,125,49,130],[49,135,49,140],[46,121,46,124],[46,125,46,130],[46,135,46,140],[48,151,48,154],[49,151,49,154],[50,151,50,154],[43,141,43,144],[53,141,53,144],[50,141,50,144],[51,141,51,144],[52,141,52,144],[50,145,50,150],[51,145,51,150],[52,145,52,150],[49,141,49,144],[51,151,51,154],[52,151,52,154],[53,151,53,154],[53,145,53,150],[49,145,49,150],[29,151,29,154],[29,155,29,160],[40,125,40,130],[30,111,30,114],[40,121,40,124],[39,125,39,130],[29,111,29,114],[38,125,38,130],[37,125,37,130],[36,125,36,130],[35,125,35,130],[34,125,34,130],[32,125,32,130],[31,125,31,130],[30,125,30,130],[29,125,29,130],[35,131,35,134],[36,131,36,134],[37,131,37,134],[32,131,32,134],[33,131,33,134],[34,131,34,134],[35,141,35,144],[36,141,36,144],[52,125,52,130],[53,125,53,130],[41,121,41,124],[42,121,42,124],[47,121,47,124],[28,125,28,130],[27,125,27,130],[26,125,26,130],[24,111,24,114],[25,111,25,114],[26,111,26,114],[27,111,27,114],[28,111,28,114],[27,121,27,124],[28,121,28,124],[24,125,24,130],[53,115,53,120],[52,115,52,120],[51,115,51,120],[50,115,50,120],[49,115,49,120],[47,111,47,114],[48,111,48,114],[52,111,52,114],[53,111,53,114],[23,121,23,124],[49,111,49,114],[50,111,50,114],[51,111,51,114],[24,121,24,124],[35,121,35,124],[36,121,36,124],[23,115,23,120],[33,121,33,124],[30,121,30,124],[31,121,31,124],[32,121,32,124],[23,111,23,114],[31,111,31,114],[32,111,32,114],[32,115,32,120],[45,121,45,124],[37,115,37,120],[49,121,49,124],[50,121,50,124],[41,115,41,120],[40,115,40,120],[39,115,39,120],[23,131,23,134],[24,131,24,134],[25,131,25,134],[51,121,51,124],[52,121,52,124],[53,121,53,124],[29,131,29,134],[30,131,30,134],[31,131,31,134],[48,131,48,134],[49,131,49,134],[50,131,50,134],[45,131,45,134],[46,131,46,134],[47,131,47,134],[43,131,43,134],[44,131,44,134],[42,131,42,134],[38,131,38,134],[39,131,39,134],[40,131,40,134],[23,125,23,130],[50,125,50,130],[51,125,51,130],[33,20,33,28],[34,15,34,19],[34,20,34,28],[35,15,35,19],[35,20,35,28],[36,15,36,19],[36,20,36,28],[37,15,37,19],[37,20,37,28],[38,15,38,19],[38,20,38,28],[31,34,31,42],[32,29,32,33],[33,141,33,144],[34,141,34,144],[36,135,36,140],[41,141,41,144],[42,141,42,144],[42,135,42,140],[37,135,37,140],[34,135,34,140],[35,135,35,140],[38,71,38,75],[38,76,38,84],[39,71,39,75],[39,76,39,84],[40,71,40,75],[40,76,40,84],[32,76,32,84],[33,71,33,75],[33,76,33,84],[34,71,34,75],[34,76,34,84],[32,145,32,150],[33,145,33,150],[34,145,34,150],[38,145,38,150],[39,145,39,150],[40,145,40,150],[35,145,35,150],[36,145,36,150],[37,145,37,150],[23,161,23,164],[24,161,24,164],[25,161,25,164],[41,145,41,150],[42,145,42,150],[43,145,43,150],[26,161,26,164],[27,161,27,164],[28,161,28,164],[23,155,23,160],[24,155,24,160],[25,155,25,160],[23,151,23,154],[24,151,24,154],[25,151,25,154],[25,145,25,150],[29,145,29,150],[30,145,30,150],[31,145,31,150],[29,161,29,164],[30,161,30,164],[31,161,31,164],[38,161,38,164],[33,161,33,164],[34,161,34,164],[35,161,35,164],[32,161,32,164],[35,155,35,160],[43,161,43,164],[44,161,44,164],[42,155,42,160],[43,155,43,160],[44,155,44,160],[39,155,39,160],[46,161,46,164],[23,165,23,170],[24,165,24,170],[25,165,25,170],[51,155,51,160],[52,155,52,160],[53,155,53,160],[32,165,32,170],[29,165,29,170],[30,165,30,170],[31,165,31,170],[26,165,26,170],[27,165,27,170],[28,165,28,170],[36,165,36,170],[37,165,37,170],[38,165,38,170],[33,165,33,170],[34,165,34,170],[35,165,35,170],[46,165,46,170],[43,165,43,170],[44,165,44,170],[45,165,45,170],[26,155,26,160],[32,57,32,61],[32,62,32,70],[33,57,33,61],[33,62,33,70],[34,57,34,61],[34,62,34,70],[35,57,35,61],[35,62,35,70],[31,57,31,61],[31,62,31,70],[26,71,26,75],[26,76,26,84],[27,71,27,75],[27,76,27,84],[28,71,28,75],[28,76,28,84],[29,71,29,75],[29,76,29,84],[30,71,30,75],[30,76,30,84],[31,71,31,75],[31,76,31,84],[32,71,32,75],[45,57,45,61],[46,57,46,61],[47,57,47,61],[48,57,48,61],[49,57,49,61],[52,57,52,61],[36,57,36,61],[36,62,36,70],[37,57,37,61],[37,62,37,70],[38,57,38,61],[38,62,38,70],[39,57,39,61],[39,62,39,70],[45,62,45,70],[46,62,46,70],[47,62,47,70],[48,62,48,70],[49,62,49,70],[50,57,50,61],[50,62,50,70],[51,57,51,61],[51,62,51,70],[52,62,52,70],[35,71,35,75],[35,76,35,84],[40,111,40,114],[41,111,41,114],[42,111,42,114],[43,111,43,114],[44,111,44,114],[45,111,45,114],[46,111,46,114],[46,71,46,75],[46,76,46,84],[43,85,43,89],[43,90,43,98],[44,85,44,89],[44,90,44,98],[45,85,45,89],[45,90,45,98],[38,90,38,98],[39,85,39,89],[39,90,39,98],[40,85,40,89],[40,90,40,98],[22,111,22,114],[33,111,33,114],[34,111,34,114],[35,111,35,114],[36,111,36,114],[37,111,37,114],[38,111,38,114],[39,111,39,114],[26,145,26,150],[27,145,27,150],[28,145,28,150],[22,121,22,124],[22,125,22,130],[23,135,23,140],[24,135,24,140],[38,135,38,140],[39,135,39,140],[31,135,31,140],[32,135,32,140],[33,135,33,140],[29,135,29,140],[30,135,30,140],[26,131,26,134],[27,131,27,134],[26,151,26,154],[27,151,27,154],[28,151,28,154],[28,135,28,140],[36,151,36,154],[51,71,51,75],[51,76,51,84],[49,71,49,75],[49,76,49,84],[50,71,50,75],[50,76,50,84],[41,71,41,75],[41,76,41,84],[42,71,42,75],[42,76,42,84],[43,71,43,75],[43,76,43,84],[44,71,44,75],[44,76,44,84],[45,71,45,75],[45,76,45,84],[43,121,43,124],[43,125,43,130],[44,121,44,124],[28,131,28,134],[53,131,53,134],[23,141,23,144],[24,141,24,144],[25,141,25,144],[26,141,26,144],[27,141,27,144],[28,141,28,144],[29,141,29,144],[30,141,30,144],[31,141,31,144],[32,141,32,144],[25,135,25,140],[26,135,26,140],[27,135,27,140],[51,131,51,134],[51,135,51,140],[52,131,52,134],[52,135,52,140],[47,141,47,144],[48,141,48,144],[37,141,37,144],[44,141,44,144],[45,141,45,144],[45,161,45,164],[67,63,67,83],[67,84,67,101],[0,0,1,53],[39,161,39,164],[39,165,39,170],[40,161,40,164],[40,165,40,170],[41,161,41,164],[41,165,41,170],[30,151,30,154],[30,155,30,160],[31,151,31,154],[31,155,31,160],[27,155,27,160],[28,155,28,160],[36,161,36,164],[37,161,37,164],[22,141,22,144],[32,151,32,154],[33,151,33,154],[34,151,34,154],[35,151,35,154],[22,131,22,134],[63,0,63,26],[64,0,64,26],[65,0,65,26],[67,0,67,14],[67,15,67,26],[3,62,3,83],[3,84,3,99],[4,62,4,83],[4,84,4,99],[5,62,5,83],[3,0,3,12],[3,13,3,58],[4,13,4,58],[5,13,5,58],[52,71,52,75],[52,76,52,84],[47,71,47,75],[47,76,47,84],[48,71,48,75],[48,76,48,84],[36,71,36,75],[36,76,36,84],[37,71,37,75],[37,76,37,84]]}
[{"$f":"IF(Data!$AE$2=\"DE\",\"Messprotokoll\",IF(Data!$AE$2=\"UK\",\"Measurement protocol\",IF(Data!$AE$2=\"FR\",\"Rapport de mesure\",\"Language Error\")))","v":"Measurement protocol"}]
[]
[]
[{"$f":"IF(Data!$AE$2 = \"DE\", \"Prüfling:\", IF(Data!$AE$2 = \"UK\",\"Test object:\",IF(Data!$AE$2=\"FR\",\"Objet testé:\",\"Language Error\")))","v":"Test object:"},null,null,null,null,null,null,null,null,null,null,null,null,{"$f":"'Protocol 1 (5nm)'!N4:BG4","v":"Manufacturer"},null,null,null,null,null,null,null,null,null,null,null,null,null,null,null,null,null,null,null,null,null,null,null,null,null,null,null,null,null,null,null,null,null,null,null,null,null,null,null,null,null,null,null,null,null,null,null,null,{"$f":"IF(Data!$AE$2=\"DE\",\"Messdatei:\",IF(Data!$AE$2=\"UK\",\"Measurement file:\",IF(Data!$AE$2=\"FR\",\"Fichier de mesure:\",\"Language Error\")))","v":"Measurement file:"},null,null,null,null,null,null,null,null,null,null,null,null,null,null,null,null,null,null,null,null,null,{"$f":"Data!Q18","v":"M_000003.CSV"}]
[null,null,null,null,null,null,null,null,null,null,null,null,null,{"$f":"'Protocol 1 (5nm)'!N5:BG5","v":"Type"},null,null,null,null,null,null,null,null,null,null,null,null,null,null,null,null,null,null,null,null,null,null,null,null,null,null,null,null,null,null,null,null,null,null,null,null,null,null,null,null,null,null,null,null,null,null,null,null,{"$f":"IF(Data!$AE$2=\"DE\",\"Datum der Messung:\",IF(Data!$AE$2=\"UK\",\"Date of measurement:\",IF(Data!$AE$2=\"FR\",\"Date de mesure:\",\"Language Error\")))","v":"Date of measurement:"},null,null,null,null,null,null,null,null,null,null,null,null,null,null,null,null,null,null,null,null,null,{"$f":"Data!Q23","v":"29.04.2024"}]
[null,null,null,null,null,null,null,null,null,null,null,null,null,{"$f":"'Protocol 1 (5nm)'!N6:BG6","v":"Model"},null,null,null,null,null,null,null,null,null,null,null,null,null,null,null,null,null,null,null,null,null,null,null,null,null,null,null,null,null,null,null,null,null,null,null,null,null,null,null,null,null,null,null,null,null,null,null,null,{"$f":"IF(Data!$AE$2=\"DE\",\"Uhrzeit der Messung:\",IF(Data!$AE$2=\"UK\",\"Time of measurement:\",IF(Data!$AE$2=\"FR\",\"Heure de mesure:\",\"Language Error\")))","v":"Time of measurement:"},null,null,null,null,null,null,null,null,null,null,null,null,null,null,null,null,null,null,null,null,null,{"$f":"Data!Q21","v":"08:07:17"}]
[]
[]
[]
[]
[]
[]
[]
[]
[]
[]
[]
[]
[]
[]
[]
[null,"[nm]",null,null,null,null,"mW/m²/nm",null,null,null,null,null,null,null,null,"[nm]",null,null,null,null,"mW/m²/nm",null,null,null,null,null,null,null,null,"[nm]",null,null,null,null,"mW/m²/nm",null,null,null,null,null,null,null,null,"[nm]",null,null,null,null,"mW/m²/nm",null,null,null,null,null,null,null,null,"[nm]",null,null,null,null,"mW/m²/nm",null,null,null,null,null,null,null,null,"[nm]",null,null,null,null,"mW/m²/nm",null,null,null,null,null,null,null,null,"[nm]",null,null,null,null,"mW/m²/nm"]
[null,{"$f":"Data!$G1","v":380},null,null,null,null,{"$f":"Data!$H1","v":0.68384},null,null,null,null,null,null,null,null,{"$f":"Data!$G32","v":535},null,null,null,null,{"$f":"Data!$H32","v":41.304229999999997},null,null,null,null,null,null,null,null,{"$f":"IF(Data!$G63=\"\",\"\",Data!$G63)","v":690},null,null,null,null,{"$f":"IF(Data!$H63=\"\",\"\",Data!$H63)","v":14.52068},null,null,null,null,null,null,null,null,{"$f":"IF(Data!$G94=\"\",\"\",Data!$G94)","v":""},null,null,null,null,{"$f":"IF(Data!$H94=\"\",\"\",Data!$H94)","v":""},null,null,null,null,null,null,null,null,{"$f":"IF(Data!$G125=\"\",\"\",Data!$G125)","v":""},null,null,null,null,{"$f":"IF(Data!$H125=\"\",\"\",Data!$H125)","v":""},null,null,null,null,null,null,null,null,{"$f":"IF(Data!$G156=\"\",\"\",Data!$G156)","v":""},null,null,null,null,{"$f":"IF(Data!$H156=\"\",\"\",Data!$H156)","v":""},null,null,null,null,null,null,null,null,{"$f":"IF(Data!$G187=\"\",\"\",Data!$G187)","v":""},null,null,null,null,{"$f":"IF(Data!$H187=\"\",\"\",Data!$H187)","v":""}]
[null,{"$f":"Data!$G2","v":385},null,null,null,null,{"$f":"Data!$H2","v":0.74607000000000001},null,null,null,null,null,null,null,null,{"$f":"Data!$G33","v":540},null,null,null,null,{"$f":"Data!$H33","v":42.239730000000002},null,null,null,null,null,null,null,null,{"$f":"IF(Data!$G64=\"\",\"\",Data!$G64)","v":695},null,null,null,null,{"$f":"IF(Data!$H64=\"\",\"\",Data!$H64)","v":13.57545},null,null,null,null,null,null,null,null,{"$f":"IF(Data!$G95=\"\",\"\",Data!$G95)","v":""},null,null,null,null,{"$f":"IF(Data!$H95=\"\",\"\",Data!$H95)","v":""},null,null,null,null,null,null,null,null,{"$f":"IF(Data!$G126=\"\",\"\",Data!$G126)","v":""},null,null,null,null,{"$f":"IF(Data!$H126=\"\",\"\",Data!$H126)","v":""},null,null,null,null,null,null,null,null,{"$f":"IF(Data!$G157=\"\",\"\",Data!$G157)","v":""},null,null,null,null,{"$f":"IF(Data!$H157=\"\",\"\",Data!$H157)","v":""},null,null,null,null,null,null,null,null,{"$f":"IF(Data!$G188=\"\",\"\",Data!$G188)","v":""},null,null,null,null,{"$f":"IF(Data!$H188=\"\",\"\",Data!$H188)","v":""}]
[null,{"$f":"Data!$G3","v":390},null,null,null,null,{"$f":"Data!$H3","v":0.91386999999999996},null,null,null,null,null,null,null,null,{"$f":"Data!$G34","v":545},null,null,null,null,{"$f":"Data!$H34","v":43.382800000000003},null,null,null,null,null,null,null,null,{"$f":"IF(Data!$G65=\"\",\"\",Data!$G65)","v":700},null,null,null,null,{"$f":"IF(Data!$H65=\"\",\"\",Data!$H65)","v":13.04884},null,null,null,null,null,null,null,null,{"$f":"IF(Data!$G96=\"\",\"\",Data!$G96)","v":""},null,null,null,null,{"$f":"IF(Data!$H96=\"\",\"\",Data!$H96)","v":""},null,null,null,null,null,null,null,null,{"$f":"IF(Data!$G127=\"\",\"\",Data!$G127)","v":""},null,null,null,null,{"$f":"IF(Data!$H127=\"\",\"\",Data!$H127)","v":""},null,null,null,null,null,null,null,null,{"$f":"IF(Data!$G158=\"\",\"\",Data!$G158)","v":""},null,null,null,null,{"$f":"IF(Data!$H158=\"\",\"\",Data!$H158)","v":""},null,null,null,null,null,null,null,null,{"$f":"IF(Data!$G189=\"\",\"\",Data!$G189)","v":""},null,null,null,null,{"$f":"IF(Data!$H189=\"\",\"\",Data!$H189)","v":""}]
[null,{"$f":"Data!$G4","v":395},null,null,null,null,{"$f":"Data!$H4","v":1.2555099999999999},null,null,null,null,null,null,null,null,{"$f":"Data!$G35","v":550},null,null,null,null,{"$f":"Data!$H35","v":44.504919999999998},null,null,null,null,null,null,null,null,{"$f":"IF(Data!$G66=\"\",\"\",Data!$G66)","v":705},null,null,null,null,{"$f":"IF(Data!$H66=\"\",\"\",Data!$H66)","v":12.820119999999999},null,null,null,null,null,null,null,null,{"$f":"IF(Data!$G97=\"\",\"\",Data!$G97)","v":""},null,null,null,null,{"$f":"IF(Data!$H97=\"\",\"\",Data!$H97)","v":""},null,null,null,null,null,null,null,null,{"$f":"IF(Data!$G128=\"\",\"\",Data!$G128)","v":""},null,null,null,null,{"$f":"IF(Data!$H128=\"\",\"\",Data!$H128)","v":""},null,null,null,null,null,null,null,null,{"$f":"IF(Data!$G159=\"\",\"\",Data!$G159)","v":""},null,null,null,null,{"$f":"IF(Data!$H159=\"\",\"\",Data!$H159)","v":""},null,null,null,null,null,null,null,null,{"$f":"IF(Data!$G190=\"\",\"\",Data!$G190)","v":""},null,null,null,null,{"$f":"IF(Data!$H190=\"\",\"\",Data!$H190)","v":""}]
[null,{"$f":"Data!$G5","v":400},null,null,null,null,{"$f":"Data!$H5","v":1.8004599999999999},null,null,null,null,null,null,null,null,{"$f":"Data!$G36","v":555},null,null,null,null,{"$f":"Data!$H36","v":45.709710000000001},null,null,null,null,null,null,null,null,{"$f":"IF(Data!$G67=\"\",\"\",Data!$G67)","v":710},null,null,null,null,{"$f":"IF(Data!$H67=\"\",\"\",Data!$H67)","v":12.3506},null,null,null,null,null,null,null,null,{"$f":"IF(Data!$G98=\"\",\"\",Data!$G98)","v":""},null,null,null,null,{"$f":"IF(Data!$H98=\"\",\"\",Data!$H98)","v":""},null,null,null,null,null,null,null,null,{"$f":"IF(Data!$G129=\"\",\"\",Data!$G129)","v":""},null,null,null,null,{"$f":"IF(Data!$H129=\"\",\"\",Data!$H129)","v":""},null,null,null,null,null,null,null,null,{"$f":"IF(Data!$G160=\"\",\"\",Data!$G160)","v":""},null,null,null,null,{"$f":"IF(Data!$H160=\"\",\"\",Data!$H160)","v":""},null,null,null,null,null,null,null,null,{"$f":"IF(Data!$G191=\"\",\"\",Data!$G191)","v":""},null,null,null,null,{"$f":"IF(Data!$H191=\"\",\"\",Data!$H191)","v":""}]
[null,{"$f":"Data!$G6","v":405},null,null,null,null,{"$f":"Data!$H6","v":2.1574399999999998},null,null,null,null,null,null,null,null,{"$f":"Data!$G37","v":560},null,null,null,null,{"$f":"Data!$H37","v":47.049399999999999},null,null,null,null,null,null,null,null,{"$f":"IF(Data!$G68=\"\",\"\",Data!$G68)","v":715},null,null,null,null,{"$f":"IF(Data!$H68=\"\",\"\",Data!$H68)","v":11.118410000000001},null,null,null,null,null,null,null,null,{"$f":"IF(Data!$G99=\"\",\"\",Data!$G99)","v":""},null,null,null,null,{"$f":"IF(Data!$H99=\"\",\"\",Data!$H99)","v":""},null,null,null,null,null,null,null,null,{"$f":"IF(Data!$G130=\"\",\"\",Data!$G130)","v":""},null,null,null,null,{"$f":"IF(Data!$H130=\"\",\"\",Data!$H130)","v":""},null,null,null,null,null,null,null,null,{"$f":"IF(Data!$G161=\"\",\"\",Data!$G161)","v":""},null,null,null,null,{"$f":"IF(Data!$H161=\"\",\"\",Data!$H161)","v":""},null,null,null,null,null,null,null,null,{"$f":"IF(Data!$G192=\"\",\"\",Data!$G192)","v":""},null,null,null,null,{"$f":"IF(Data!$H192=\"\",\"\",Data!$H192)","v":""}]
[null,{"$f":"Data!$G7","v":410},null,null,null,null,{"$f":"Data!$H7","v":2.7395700000000001},null,null,null,null,null,null,null,null,{"$f":"Data!$G38","v":565},null,null,null,null,{"$f":"Data!$H38","v":48.187980000000003},null,null,null,null,null,null,null,null,{"$f":"IF(Data!$G69=\"\",\"\",Data!$G69)","v":720},null,null,null,null,{"$f":"IF(Data!$H69=\"\",\"\",Data!$H69)","v":10.232659999999999},null,null,null,null,null,null,null,null,{"$f":"IF(Data!$G100=\"\",\"\",Data!$G100)","v":""},null,null,null,null,{"$f":"IF(Data!$H100=\"\",\"\",Data!$H100)","v":""},null,null,null,null,null,null,null,null,{"$f":"IF(Data!$G131=\"\",\"\",Data!$G131)","v":""},null,null,null,null,{"$f":"IF(Data!$H131=\"\",\"\",Data!$H131)","v":""},null,null,null,null,null,null,null,null,{"$f":"IF(Data!$G162=\"\",\"\",Data!$G162)","v":""},null,null,null,null,{"$f":"IF(Data!$H162=\"\",\"\",Data!$H162)","v":""},null,null,null,null,null,null,null,null,{"$f":"IF(Data!$G193=\"\",\"\",Data!$G193)","v":""},null,null,null,null,{"$f":"IF(Data!$H193=\"\",\"\",Data!$H193)","v":""}]
[null,{"$f":"Data!$G8","v":415},null,null,null,null,{"$f":"Data!$H8","v":3.6223900000000002},null,null,null,null,null,null,null,null,{"$f":"Data!$G39","v":570},null,null,null,null,{"$f":"Data!$H39","v":49.69511},null,null,null,null,null,null,null,null,{"$f":"IF(Data!$G70=\"\",\"\",Data!$G70)","v":725},null,null,null,null,{"$f":"IF(Data!$H70=\"\",\"\",Data!$H70)","v":9.8008000000000006},null,null,null,null,null,null,null,null,{"$f":"IF(Data!$G101=\"\",\"\",Data!$G101)","v":""},null,null,null,null,{"$f":"IF(Data!$H101=\"\",\"\",Data!$H101)","v":""},null,null,null,null,null,null,null,null,{"$f":"IF(Data!$G132=\"\",\"\",Data!$G132)","v":""},null,null,null,null,{"$f":"IF(Data!$H132=\"\",\"\",Data!$H132)","v":""},null,null,null,null,null,null,null,null,{"$f":"IF(Data!$G163=\"\",\"\",Data!$G163)","v":""},null,null,null,null,{"$f":"IF(Data!$H163=\"\",\"\",Data!$H163)","v":""},null,null,null,null,null,null,null,null,{"$f":"IF(Data!$G194=\"\",\"\",Data!$G194)","v":""},null,null,null,null,{"$f":"IF(Data!$H194=\"\",\"\",Data!$H194)","v":""}]
[null,{"$f":"Data!$G9","v":420},null,null,null,null,{"$f":"Data!$H9","v":4.6374399999999998},null,null,null,null,null,null,null,null,{"$f":"Data!$G40","v":575},null,null,null,null,{"$f":"Data!$H40","v":51.013109999999998},null,null,null,null,null,null,null,null,{"$f":"IF(Data!$G71=\"\",\"\",Data!$G71)","v":730},null,null,null,null,{"$f":"IF(Data!$H71=\"\",\"\",Data!$H71)","v":10.161989999999999},null,null,null,null,null,null,null,null,{"$f":"IF(Data!$G102=\"\",\"\",Data!$G102)","v":""},null,null,null,null,{"$f":"IF(Data!$H102=\"\",\"\",Data!$H102)","v":""},null,null,null,null,null,null,null,null,{"$f":"IF(Data!$G133=\"\",\"\",Data!$G133)","v":""},null,null,null,null,{"$f":"IF(Data!$H133=\"\",\"\",Data!$H133)","v":""},null,null,null,null,null,null,null,null,{"$f":"IF(Data!$G164=\"\",\"\",Data!$G164)","v":""},null,null,null,null,{"$f":"IF(Data!$H164=\"\",\"\",Data!$H164)","v":""},null,null,null,null,null,null,null,null,{"$f":"IF(Data!$G195=\"\",\"\",Data!$G195)","v":""},null,null,null,null,{"$f":"IF(Data!$H195=\"\",\"\",Data!$H195)","v":""}]
[null,{"$f":"Data!$G10","v":425},null,null,null,null,{"$f":"Data!$H10","v":6.1680599999999997},null,null,null,null,null,null,null,null,{"$f":"Data!$G41","v":580},null,null,null,null,{"$f":"Data!$H41","v":52.255859999999998},null,null,null,null,null,null,null,null,{"$f":"IF(Data!$G72=\"\",\"\",Data!$G72)","v":735},null,null,null,null,{"$f":"IF(Data!$H72=\"\",\"\",Data!$H72)","v":10.65001},null,null,null,null,null,null,null,null,{"$f":"IF(Data!$G103=\"\",\"\",Data!$G103)","v":""},null,null,null,null,{"$f":"IF(Data!$H103=\"\",\"\",Data!$H103)","v":""},null,null,null,null,null,null,null,null,{"$f":"IF(Data!$G134=\"\",\"\",Data!$G134)","v":""},null,null,null,null,{"$f":"IF(Data!$H134=\"\",\"\",Data!$H134)","v":""},null,null,null,null,null,null,null,null,{"$f":"IF(Data!$G165=\"\",\"\",Data!$G165)","v":""},null,null,null,null,{"$f":"IF(Data!$H165=\"\",\"\",Data!$H165)","v":""},null,null,null,null,null,null,null,null,{"$f":"IF(Data!$G196=\"\",\"\",Data!$G196)","v":""},null,null,null,null,{"$f":"IF(Data!$H196=\"\",\"\",Data!$H196)","v":""}]
[null,{"$f":"Data!$G11","v":430},null,null,null,null,{"$f":"Data!$H11","v":8.7164999999999999},null,null,null,null,null,null,null,null,{"$f":"Data!$G42","v":585},null,null,null,null,{"$f":"Data!$H42","v":53.208840000000002},null,null,null,null,null,null,null,null,{"$f":"IF(Data!$G73=\"\",\"\",Data!$G73)","v":740},null,null,null,null,{"$f":"IF(Data!$H73=\"\",\"\",Data!$H73)","v":11.0448},null,null,null,null,null,null,null,null,{"$f":"IF(Data!$G104=\"\",\"\",Data!$G104)","v":""},null,null,null,null,{"$f":"IF(Data!$H104=\"\",\"\",Data!$H104)","v":""},null,null,null,null,null,null,null,null,{"$f":"IF(Data!$G135=\"\",\"\",Data!$G135)","v":""},null,null,null,null,{"$f":"IF(Data!$H135=\"\",\"\",Data!$H135)","v":""},null,null,null,null,null,null,null,null,{"$f":"IF(Data!$G166=\"\",\"\",Data!$G166)","v":""},null,null,null,null,{"$f":"IF(Data!$H166=\"\",\"\",Data!$H166)","v":""},null,null,null,null,null,null,null,null,{"$f":"IF(Data!$G197=\"\",\"\",Data!$G197)","v":""},null,null,null,null,{"$f":"IF(Data!$H197=\"\",\"\",Data!$H197)","v":""}]
[null,{"$f":"Data!$G12","v":435},null,null,null,null,{"$f":"Data!$H12","v":13.82133},null,null,null,null,null,null,null,null,{"$f":"Data!$G43","v":590},null,null,null,null,{"$f":"Data!$H43","v":53.498269999999998},null,null,null,null,null,null,null,null,{"$f":"IF(Data!$G74=\"\",\"\",Data!$G74)","v":745},null,null,null,null,{"$f":"IF(Data!$H74=\"\",\"\",Data!$H74)","v":11.26281},null,null,null,null,null,null,null,null,{"$f":"IF(Data!$G105=\"\",\"\",Data!$G105)","v":""},null,null,null,null,{"$f":"IF(Data!$H105=\"\",\"\",Data!$H105)","v":""},null,null,null,null,null,null,null,null,{"$f":"IF(Data!$G136=\"\",\"\",Data!$G136)","v":""},null,null,null,null,{"$f":"IF(Data!$H136=\"\",\"\",Data!$H136)","v":""},null,null,null,null,null,null,null,null,{"$f":"IF(Data!$G167=\"\",\"\",Data!$G167)","v":""},null,null,null,null,{"$f":"IF(Data!$H167=\"\",\"\",Data!$H167)","v":""},null,null,null,null,null,null,null,null,{"$f":"IF(Data!$G198=\"\",\"\",Data!$G198)","v":""},null,null,null,null,{"$f":"IF(Data!$H198=\"\",\"\",Data!$H198)","v":""}]
[null,{"$f":"Data!$G13","v":440},null,null,null,null,{"$f":"Data!$H13","v":23.31664},null,null,null,null,null,null,null,null,{"$f":"Data!$G44","v":595},null,null,null,null,{"$f":"Data!$H44","v":53.85181},null,null,null,null,null,null,null,null,{"$f":"IF(Data!$G75=\"\",\"\",Data!$G75)","v":750},null,null,null,null,{"$f":"IF(Data!$H75=\"\",\"\",Data!$H75)","v":11.173349999999999},null,null,null,null,null,null,null,null,{"$f":"IF(Data!$G106=\"\",\"\",Data!$G106)","v":""},null,null,null,null,{"$f":"IF(Data!$H106=\"\",\"\",Data!$H106)","v":""},null,null,null,null,null,null,null,null,{"$f":"IF(Data!$G137=\"\",\"\",Data!$G137)","v":""},null,null,null,null,{"$f":"IF(Data!$H137=\"\",\"\",Data!$H137)","v":""},null,null,null,null,null,null,null,null,{"$f":"IF(Data!$G168=\"\",\"\",Data!$G168)","v":""},null,null,null,null,{"$f":"IF(Data!$H168=\"\",\"\",Data!$H168)","v":""},null,null,null,null,null,null,null,null,{"$f":"IF(Data!$G199=\"\",\"\",Data!$G199)","v":""},null,null,null,null,{"$f":"IF(Data!$H199=\"\",\"\",Data!$H199)","v":""}]
[null,{"$f":"Data!$G14","v":445},null,null,null,null,{"$f":"Data!$H14","v":38.419719999999998},null,null,null,null,null,null,null,null,{"$f":"Data!$G45","v":600},null,null,null,null,{"$f":"Data!$H45","v":53.785820000000001},null,null,null,null,null,null,null,null,{"$f":"IF(Data!$G76=\"\",\"\",Data!$G76)","v":755},null,null,null,null,{"$f":"IF(Data!$H76=\"\",\"\",Data!$H76)","v":9.8014100000000006},null,null,null,null,null,null,null,null,{"$f":"IF(Data!$G107=\"\",\"\",Data!$G107)","v":""},null,null,null,null,{"$f":"IF(Data!$H107=\"\",\"\",Data!$H107)","v":""},null,null,null,null,null,null,null,null,{"$f":"IF(Data!$G138=\"\",\"\",Data!$G138)","v":""},null,null,null,null,{"$f":"IF(Data!$H138=\"\",\"\",Data!$H138)","v":""},null,null,null,null,null,null,null,null,{"$f":"IF(Data!$G169=\"\",\"\",Data!$G169)","v":""},null,null,null,null,{"$f":"IF(Data!$H169=\"\",\"\",Data!$H169)","v":""},null,null,null,null,null,null,null,null,{"$f":"IF(Data!$G200=\"\",\"\",Data!$G200)","v":""},null,null,null,null,{"$f":"IF(Data!$H200=\"\",\"\",Data!$H200)","v":""}]
[null,{"$f":"Data!$G15","v":450},null,null,null,null,{"$f":"Data!$H15","v":50.485010000000003},null,null,null,null,null,null,null,null,{"$f":"Data!$G46","v":605},null,null,null,null,{"$f":"Data!$H46","v":52.931550000000001},null,null,null,null,null,null,null,null,{"$f":"IF(Data!$G77=\"\",\"\",Data!$G77)","v":760},null,null,null,null,{"$f":"IF(Data!$H77=\"\",\"\",Data!$H77)","v":7.5748499999999996},null,null,null,null,null,null,null,null,{"$f":"IF(Data!$G108=\"\",\"\",Data!$G108)","v":""},null,null,null,null,{"$f":"IF(Data!$H108=\"\",\"\",Data!$H108)","v":""},null,null,null,null,null,null,null,null,{"$f":"IF(Data!$G139=\"\",\"\",Data!$G139)","v":""},null,null,null,null,{"$f":"IF(Data!$H139=\"\",\"\",Data!$H139)","v":""},null,null,null,null,null,null,null,null,{"$f":"IF(Data!$G170=\"\",\"\",Data!$G170)","v":""},null,null,null,null,{"$f":"IF(Data!$H170=\"\",\"\",Data!$H170)","v":""},null,null,null,null,null,null,null,null,{"$f":"IF(Data!$G201=\"\",\"\",Data!$G201)","v":""},null,null,null,null,{"$f":"IF(Data!$H201=\"\",\"\",Data!$H201)","v":""}]
[null,{"$f":"Data!$G16","v":455},null,null,null,null,{"$f":"Data!$H16","v":48.125909999999998},null,null,null,null,null,null,null,null,{"$f":"Data!$G47","v":610},null,null,null,null,{"$f":"Data!$H47","v":51.470959999999998},null,null,null,null,null,null,null,null,{"$f":"IF(Data!$G78=\"\",\"\",Data!$G78)","v":765},null,null,null,null,{"$f":"IF(Data!$H78=\"\",\"\",Data!$H78)","v":7.42204},null,null,null,null,null,null,null,null,{"$f":"IF(Data!$G109=\"\",\"\",Data!$G109)","v":""},null,null,null,null,{"$f":"IF(Data!$H109=\"\",\"\",Data!$H109)","v":""},null,null,null,null,null,null,null,null,{"$f":"IF(Data!$G140=\"\",\"\",Data!$G140)","v":""},null,null,null,null,{"$f":"IF(Data!$H140=\"\",\"\",Data!$H140)","v":""},null,null,null,null,null,null,null,null,{"$f":"IF(Data!$G171=\"\",\"\",Data!$G171)","v":""},null,null,null,null,{"$f":"IF(Data!$H171=\"\",\"\",Data!$H171)","v":""},null,null,null,null,null,null,null,null,{"$f":"IF(Data!$G202=\"\",\"\",Data!$G202)","v":""},null,null,null,null,{"$f":"IF(Data!$H202=\"\",\"\",Data!$H202)","v":""}]
[null,{"$f":"Data!$G17","v":460},null,null,null,null,{"$f":"Data!$H17","v":37.257539999999999},null,null,null,null,null,null,null,null,{"$f":"Data!$G48","v":615},null,null,null,null,{"$f":"Data!$H48","v":49.462730000000001},null,null,null,null,null,null,null,null,{"$f":"IF(Data!$G79=\"\",\"\",Data!$G79)","v":770},null,null,null,null,{"$f":"IF(Data!$H79=\"\",\"\",Data!$H79)","v":9.3577700000000004},null,null,null,null,null,null,null,null,{"$f":"IF(Data!$G110=\"\",\"\",Data!$G110)","v":""},null,null,null,null,{"$f":"IF(Data!$H110=\"\",\"\",Data!$H110)","v":""},null,null,null,null,null,null,null,null,{"$f":"IF(Data!$G141=\"\",\"\",Data!$G141)","v":""},null,null,null,null,{"$f":"IF(Data!$H141=\"\",\"\",Data!$H141)","v":""},null,null,null,null,null,null,null,null,{"$f":"IF(Data!$G172=\"\",\"\",Data!$G172)","v":""},null,null,null,null,{"$f":"IF(Data!$H172=\"\",\"\",Data!$H172)","v":""},null,null,null,null,null,null,null,null,{"$f":"IF(Data!$G203=\"\",\"\",Data!$G203)","v":""},null,null,null,null,{"$f":"IF(Data!$H203=\"\",\"\",Data!$H203)","v":""}]
[null,{"$f":"Data!$G18","v":465},null,null,null,null,{"$f":"Data!$H18","v":29.61403},null,null,null,null,null,null,null,null,{"$f":"Data!$G49","v":620},null,null,null,null,{"$f":"Data!$H49","v":47.248339999999999},null,null,null,null,null,null,null,null,{"$f":"IF(Data!$G80=\"\",\"\",Data!$G80)","v":775},null,null,null,null,{"$f":"IF(Data!$H80=\"\",\"\",Data!$H80)","v":10.22785},null,null,null,null,null,null,null,null,{"$f":"IF(Data!$G111=\"\",\"\",Data!$G111)","v":""},null,null,null,null,{"$f":"IF(Data!$H111=\"\",\"\",Data!$H111)","v":""},null,null,null,null,null,null,null,null,{"$f":"IF(Data!$G142=\"\",\"\",Data!$G142)","v":""},null,null,null,null,{"$f":"IF(Data!$H142=\"\",\"\",Data!$H142)","v":""},null,null,null,null,null,null,null,null,{"$f":"IF(Data!$G173=\"\",\"\",Data!$G173)","v":""},null,null,null,null,{"$f":"IF(Data!$H173=\"\",\"\",Data!$H173)","v":""},null,null,null,null,null,null,null,null,{"$f":"IF(Data!$G204=\"\",\"\",Data!$G204)","v":""},null,null,null,null,{"$f":"IF(Data!$H204=\"\",\"\",Data!$H204)","v":""}]
[null,{"$f":"Data!$G19","v":470},null,null,null,null,{"$f":"Data!$H19","v":24.335519999999999},null,null,null,null,null,null,null,null,{"$f":"Data!$G50","v":625},null,null,null,null,{"$f":"Data!$H50","v":44.708779999999997},null,null,null,null,null,null,null,null,{"$f":"IF(Data!$G81=\"\",\"\",Data!$G81)","v":780},null,null,null,null,{"$f":"IF(Data!$H81=\"\",\"\",Data!$H81)","v":10.4739},null,null,null,null,null,null,null,null,{"$f":"IF(Data!$G112=\"\",\"\",Data!$G112)","v":""},null,null,null,null,{"$f":"IF(Data!$H112=\"\",\"\",Data!$H112)","v":""},null,null,null,null,null,null,null,null,{"$f":"IF(Data!$G143=\"\",\"\",Data!$G143)","v":""},null,null,null,null,{"$f":"IF(Data!$H143=\"\",\"\",Data!$H143)","v":""},null,null,null,null,null,null,null,null,{"$f":"IF(Data!$G174=\"\",\"\",Data!$G174)","v":""},null,null,null,null,{"$f":"IF(Data!$H174=\"\",\"\",Data!$H174)","v":""},null,null,null,null,null,null,null,null,{"$f":"IF(Data!$G205=\"\",\"\",Data!$G205)","v":""},null,null,null,null,{"$f":"IF(Data!$H205=\"\",\"\",Data!$H205)","v":""}]
[null,{"$f":"Data!$G20","v":475},null,null,null,null,{"$f":"Data!$H20","v":20.106950000000001},null,null,null,null,null,null,null,null,{"$f":"Data!$G51","v":630},null,null,null,null,{"$f":"Data!$H51","v":41.866079999999997},null,null,null,null,null,null,null,null,{"$f":"IF(Data!$G82=\"\",\"\",Data!$G82)","v":""},null,null,null,null,{"$f":"IF(Data!$H82=\"\",\"\",Data!$H82)","v":""},null,null,null,null,null,null,null,null,{"$f":"IF(Data!$G113=\"\",\"\",Data!$G113)","v":""},null,null,null,null,{"$f":"IF(Data!$H113=\"\",\"\",Data!$H113)","v":""},null,null,null,null,null,null,null,null,{"$f":"IF(Data!$G144=\"\",\"\",Data!$G144)","v":""},null,null,null,null,{"$f":"IF(Data!$H144=\"\",\"\",Data!$H144)","v":""},null,null,null,null,null,null,null,null,{"$f":"IF(Data!$G175=\"\",\"\",Data!$G175)","v":""},null,null,null,null,{"$f":"IF(Data!$H175=\"\",\"\",Data!$H175)","v":""},null,null,null,null,null,null,null,null,{"$f":"IF(Data!$G206=\"\",\"\",Data!$G206)","v":""},null,null,null,null,{"$f":"IF(Data!$H206=\"\",\"\",Data!$H206)","v":""}]
[null,{"$f":"Data!$G21","v":480},null,null,null,null,{"$f":"Data!$H21","v":18.811810000000001},null,null,null,null,null,null,null,null,{"$f":"Data!$G52","v":635},null,null,null,null,{"$f":"Data!$H52","v":39.115130000000001},null,null,null,null,null,null,null,null,{"$f":"IF(Data!$G83=\"\",\"\",Data!$G83)","v":""},null,null,null,null,{"$f":"IF(Data!$H83=\"\",\"\",Data!$H83)","v":""},null,null,null,null,null,null,null,null,{"$f":"IF(Data!$G114=\"\",\"\",Data!$G114)","v":""},null,null,null,null,{"$f":"IF(Data!$H114=\"\",\"\",Data!$H114)","v":""},null,null,null,null,null,null,null,null,{"$f":"IF(Data!$G145=\"\",\"\",Data!$G145)","v":""},null,null,null,null,{"$f":"IF(Data!$H145=\"\",\"\",Data!$H145)","v":""},null,null,null,null,null,null,null,null,{"$f":"IF(Data!$G176=\"\",\"\",Data!$G176)","v":""},null,null,null,null,{"$f":"IF(Data!$H176=\"\",\"\",Data!$H176)","v":""},null,null,null,null,null,null,null,null,{"$f":"IF(Data!$G207=\"\",\"\",Data!$G207)","v":""},null,null,null,null,{"$f":"IF(Data!$H207=\"\",\"\",Data!$H207)","v":""}]
[null,{"$f":"Data!$G22","v":485},null,null,null,null,{"$f":"Data!$H22","v":19.296890000000001},null,null,null,null,null,null,null,null,{"$f":"Data!$G53","v":640},null,null,null,null,{"$f":"Data!$H53","v":36.297190000000001},null,null,null,null,null,null,null,null,{"$f":"IF(Data!$G84=\"\",\"\",Data!$G84)","v":""},null,null,null,null,{"$f":"IF(Data!$H84=\"\",\"\",Data!$H84)","v":""},null,null,null,null,null,null,null,null,{"$f":"IF(Data!$G115=\"\",\"\",Data!$G115)","v":""},null,null,null,null,{"$f":"IF(Data!$H115=\"\",\"\",Data!$H115)","v":""},null,null,null,null,null,null,null,null,{"$f":"IF(Data!$G146=\"\",\"\",Data!$G146)","v":""},null,null,null,null,{"$f":"IF(Data!$H146=\"\",\"\",Data!$H146)","v":""},null,null,null,null,null,null,null,null,{"$f":"IF(Data!$G177=\"\",\"\",Data!$G177)","v":""},null,null,null,null,{"$f":"IF(Data!$H177=\"\",\"\",Data!$H177)","v":""},null,null,null,null,null,null,null,null,{"$f":"IF(Data!$G208=\"\",\"\",Data!$G208)","v":""},null,null,null,null,{"$f":"IF(Data!$H208=\"\",\"\",Data!$H208)","v":""}]
[null,{"$f":"Data!$G23","v":490},null,null,null,null,{"$f":"Data!$H23","v":21.250699999999998},null,null,null,null,null,null,null,null,{"$f":"Data!$G54","v":645},null,null,null,null,{"$f":"Data!$H54","v":33.354109999999999},null,null,null,null,null,null,null,null,{"$f":"IF(Data!$G85=\"\",\"\",Data!$G85)","v":""},null,null,null,null,{"$f":"IF(Data!$H85=\"\",\"\",Data!$H85)","v":""},null,null,null,null,null,null,null,null,{"$f":"IF(Data!$G116=\"\",\"\",Data!$G116)","v":""},null,null,null,null,{"$f":"IF(Data!$H116=\"\",\"\",Data!$H116)","v":""},null,null,null,null,null,null,null,null,{"$f":"IF(Data!$G147=\"\",\"\",Data!$G147)","v":""},null,null,null,null,{"$f":"IF(Data!$H147=\"\",\"\",Data!$H147)","v":""},null,null,null,null,null,null,null,null,{"$f":"IF(Data!$G178=\"\",\"\",Data!$G178)","v":""},null,null,null,null,{"$f":"IF(Data!$H178=\"\",\"\",Data!$H178)","v":""},null,null,null,null,null,null,null,null,{"$f":"IF(Data!$G209=\"\",\"\",Data!$G209)","v":""},null,null,null,null,{"$f":"IF(Data!$H209=\"\",\"\",Data!$H209)","v":""}]
[null,{"$f":"Data!$G24","v":495},null,null,null,null,{"$f":"Data!$H24","v":24.390899999999998},null,null,null,null,null,null,null,null,{"$f":"Data!$G55","v":650},null,null,null,null,{"$f":"Data!$H55","v":30.468530000000001},null,null,null,null,null,null,null,null,{"$f":"IF(Data!$G86=\"\",\"\",Data!$G86)","v":""},null,null,null,null,{"$f":"IF(Data!$H86=\"\",\"\",Data!$H86)","v":""},null,null,null,null,null,null,null,null,{"$f":"IF(Data!$G117=\"\",\"\",Data!$G117)","v":""},null,null,null,null,{"$f":"IF(Data!$H117=\"\",\"\",Data!$H117)","v":""},null,null,null,null,null,null,null,null,{"$f":"IF(Data!$G148=\"\",\"\",Data!$G148)","v":""},null,null,null,null,{"$f":"IF(Data!$H148=\"\",\"\",Data!$H148)","v":""},null,null,null,null,null,null,null,null,{"$f":"IF(Data!$G179=\"\",\"\",Data!$G179)","v":""},null,null,null,null,{"$f":"IF(Data!$H179=\"\",\"\",Data!$H179)","v":""},null,null,null,null,null,null,null,null,{"$f":"IF(Data!$G210=\"\",\"\",Data!$G210)","v":""},null,null,null,null,{"$f":"IF(Data!$H210=\"\",\"\",Data!$H210)","v":""}]
[null,{"$f":"Data!$G25","v":500},null,null,null,null,{"$f":"Data!$H25","v":27.90953},null,null,null,null,null,null,null,null,{"$f":"Data!$G56","v":655},null,null,null,null,{"$f":"Data!$H56","v":27.645689999999998},null,null,null,null,null,null,null,null,{"$f":"IF(Data!$G87=\"\",\"\",Data!$G87)","v":""},null,null,null,null,{"$f":"IF(Data!$H87=\"\",\"\",Data!$H87)","v":""},null,null,null,null,null,null,null,null,{"$f":"IF(Data!$G118=\"\",\"\",Data!$G118)","v":""},null,null,null,null,{"$f":"IF(Data!$H118=\"\",\"\",Data!$H118)","v":""},null,null,null,null,null,null,null,null,{"$f":"IF(Data!$G149=\"\",\"\",Data!$G149)","v":""},null,null,null,null,{"$f":"IF(Data!$H149=\"\",\"\",Data!$H149)","v":""},null,null,null,null,null,null,null,null,{"$f":"IF(Data!$G180=\"\",\"\",Data!$G180)","v":""},null,null,null,null,{"$f":"IF(Data!$H180=\"\",\"\",Data!$H180)","v":""},null,null,null,null,null,null,null,null,{"$f":"IF(Data!$G211=\"\",\"\",Data!$G211)","v":""},null,null,null,null,{"$f":"IF(Data!$H211=\"\",\"\",Data!$H211)","v":""}]
[null,{"$f":"Data!$G26","v":505},null,null,null,null,{"$f":"Data!$H26","v":31.271339999999999},null,null,null,null,null,null,null,null,{"$f":"Data!$G57","v":660},null,null,null,null,{"$f":"Data!$H57","v":25.30733},null,null,null,null,null,null,null,null,{"$f":"IF(Data!$G88=\"\",\"\",Data!$G88)","v":""},null,null,null,null,{"$f":"IF(Data!$H88=\"\",\"\",Data!$H88)","v":""},null,null,null,null,null,null,null,null,{"$f":"IF(Data!$G119=\"\",\"\",Data!$G119)","v":""},null,null,null,null,{"$f":"IF(Data!$H119=\"\",\"\",Data!$H119)","v":""},null,null,null,null,null,null,null,null,{"$f":"IF(Data!$G150=\"\",\"\",Data!$G150)","v":""},null,null,null,null,{"$f":"IF(Data!$H150=\"\",\"\",Data!$H150)","v":""},null,null,null,null,null,null,null,null,{"$f":"IF(Data!$G181=\"\",\"\",Data!$G181)","v":""},null,null,null,null,{"$f":"IF(Data!$H181=\"\",\"\",Data!$H181)","v":""},null,null,null,null,null,null,null,null,{"$f":"IF(Data!$G212=\"\",\"\",Data!$G212)","v":""},null,null,null,null,{"$f":"IF(Data!$H212=\"\",\"\",Data!$H212)","v":""}]
[null,{"$f":"Data!$G27","v":510},null,null,null,null,{"$f":"Data!$H27","v":33.841369999999998},null,null,null,null,null,null,null,null,{"$f":"Data!$G58","v":665},null,null,null,null,{"$f":"Data!$H58","v":23.26774},null,null,null,null,null,null,null,null,{"$f":"IF(Data!$G89=\"\",\"\",Data!$G89)","v":""},null,null,null,null,{"$f":"IF(Data!$H89=\"\",\"\",Data!$H89)","v":""},null,null,null,null,null,null,null,null,{"$f":"IF(Data!$G120=\"\",\"\",Data!$G120)","v":""},null,null,null,null,{"$f":"IF(Data!$H120=\"\",\"\",Data!$H120)","v":""},null,null,null,null,null,null,null,null,{"$f":"IF(Data!$G151=\"\",\"\",Data!$G151)","v":""},null,null,null,null,{"$f":"IF(Data!$H151=\"\",\"\",Data!$H151)","v":""},null,null,null,null,null,null,null,null,{"$f":"IF(Data!$G182=\"\",\"\",Data!$G182)","v":""},null,null,null,null,{"$f":"IF(Data!$H182=\"\",\"\",Data!$H182)","v":""},null,null,null,null,null,null,null,null,{"$f":"IF(Data!$G213=\"\",\"\",Data!$G213)","v":""},null,null,null,null,{"$f":"IF(Data!$H213=\"\",\"\",Data!$H213)","v":""}]
[null,{"$f":"Data!$G28","v":515},null,null,null,null,{"$f":"Data!$H28","v":35.920009999999998},null,null,null,null,null,null,null,null,{"$f":"Data!$G59","v":670},null,null,null,null,{"$f":"Data!$H59","v":21.508050000000001},null,null,null,null,null,null,null,null,{"$f":"IF(Data!$G90=\"\",\"\",Data!$G90)","v":""},null,null,null,null,{"$f":"IF(Data!$H90=\"\",\"\",Data!$H90)","v":""},null,null,null,null,null,null,null,null,{"$f":"IF(Data!$G121=\"\",\"\",Data!$G121)","v":""},null,null,null,null,{"$f":"IF(Data!$H121=\"\",\"\",Data!$H121)","v":""},null,null,null,null,null,null,null,null,{"$f":"IF(Data!$G152=\"\",\"\",Data!$G152)","v":""},null,null,null,null,{"$f":"IF(Data!$H152=\"\",\"\",Data!$H152)","v":""},null,null,null,null,null,null,null,null,{"$f":"IF(Data!$G183=\"\",\"\",Data!$G183)","v":""},null,null,null,null,{"$f":"IF(Data!$H183=\"\",\"\",Data!$H183)","v":""},null,null,null,null,null,null,null,null,{"$f":"IF(Data!$G214=\"\",\"\",Data!$G214)","v":""},null,null,null,null,{"$f":"IF(Data!$H214=\"\",\"\",Data!$H214)","v":""}]
[null,{"$f":"Data!$G29","v":520},null,null,null,null,{"$f":"Data!$H29","v":37.57893},null,null,null,null,null,null,null,null,{"$f":"Data!$G60","v":675},null,null,null,null,{"$f":"Data!$H60","v":19.688700000000001},null,null,null,null,null,null,null,null,{"$f":"IF(Data!$G91=\"\",\"\",Data!$G91)","v":""},null,null,null,null,{"$f":"IF(Data!$H91=\"\",\"\",Data!$H91)","v":""},null,null,null,null,null,null,null,null,{"$f":"IF(Data!$G122=\"\",\"\",Data!$G122)","v":""},null,null,null,null,{"$f":"IF(Data!$H122=\"\",\"\",Data!$H122)","v":""},null,null,null,null,null,null,null,null,{"$f":"IF(Data!$G153=\"\",\"\",Data!$G153)","v":""},null,null,null,null,{"$f":"IF(Data!$H153=\"\",\"\",Data!$H153)","v":""},null,null,null,null,null,null,null,null,{"$f":"IF(Data!$G184=\"\",\"\",Data!$G184)","v":""},null,null,null,null,{"$f":"IF(Data!$H184=\"\",\"\",Data!$H184)","v":""},null,null,null,null,null,null,null,null,{"$f":"IF(Data!$G215=\"\",\"\",Data!$G215)","v":""},null,null,null,null,{"$f":"IF(Data!$H215=\"\",\"\",Data!$H215)","v":""}]
[null,{"$f":"Data!$G30","v":525},null,null,null,null,{"$f":"Data!$H30","v":38.95928},null,null,null,null,null,null,null,null,{"$f":"Data!$G61","v":680},null,null,null,null,{"$f":"Data!$H61","v":17.91291},null,null,null,null,null,null,null,null,{"$f":"IF(Data!$G92=\"\",\"\",Data!$G92)","v":""},null,null,null,null,{"$f":"IF(Data!$H92=\"\",\"\",Data!$H92)","v":""},null,null,null,null,null,null,null,null,{"$f":"IF(Data!$G123=\"\",\"\",Data!$G123)","v":""},null,null,null,null,{"$f":"IF(Data!$H123=\"\",\"\",Data!$H123)","v":""},null,null,null,null,null,null,null,null,{"$f":"IF(Data!$G154=\"\",\"\",Data!$G154)","v":""},null,null,null,null,{"$f":"IF(Data!$H154=\"\",\"\",Data!$H154)","v":""},null,null,null,null,null,null,null,null,{"$f":"IF(Data!$G185=\"\",\"\",Data!$G185)","v":""},null,null,null,null,{"$f":"IF(Data!$H185=\"\",\"\",Data!$H185)","v":""},null,null,null,null,null,null,null,null,{"$f":"IF(Data!$G216=\"\",\"\",Data!$G216)","v":""},null,null,null,null,{"$f":"IF(Data!$H216=\"\",\"\",Data!$H216)","v":""}]
[null,{"$f":"Data!$G31","v":530},null,null,null,null,{"$f":"Data!$H31","v":40.104469999999999},null,null,null,null,null,null,null,null,{"$f":"Data!$G62","v":685},null,null,null,null,{"$f":"Data!$H62","v":16.05528},null,null,null,null,null,null,null,null,{"$f":"IF(Data!$G93=\"\",\"\",Data!$G93)","v":""},null,null,null,null,{"$f":"IF(Data!$H93=\"\",\"\",Data!$H93)","v":""},null,null,null,null,null,null,null,null,{"$f":"IF(Data!$G124=\"\",\"\",Data!$G124)","v":""},null,null,null,null,{"$f":"IF(Data!$H124=\"\",\"\",Data!$H124)","v":""},null,null,null,null,null,null,null,null,{"$f":"IF(Data!$G155=\"\",\"\",Data!$G155)","v":""},null,null,null,null,{"$f":"IF(Data!$H155=\"\",\"\",Data!$H155)","v":""},null,null,null,null,null,null,null,null,{"$f":"IF(Data!$G186=\"\",\"\",Data!$G186)","v":""},null,null,null,null,{"$f":"IF(Data!$H186=\"\",\"\",Data!$H186)","v":""},null,null,null,null,null,null,null,null,{"$f":"IF(Data!$G217=\"\",\"\",Data!$G217)","v":""},null,null,null,null,{"$f":"IF(Data!$H217=\"\",\"\",Data!$H217)","v":""}]
[]
[]
[]
[]
[]
[]
[]
[]
[]
[]
[{"$f":"'Protocol 1 (5nm)'!A54:AA54","v":"Company"}]
[{"$f":"'Protocol 1 (5nm)'!A55:AA55","v":"Address"}]
[{"$f":"'Protocol 1 (5nm)'!A56:AA56","v":"ZIP  City"}]
[]
[{"$f":"'Protocol 1 (5nm)'!A58:O58","v":"Test location,"},null,null,null,null,null,null,null,null,null,null,null,null,null,null,{"$f":"'Protocol 1 (5nm)'!P58:AA58","v":"Date"},null,null,null,null,null,null,null,null,null,null,null,null,null,null,null,null,null,null,null,null,null,null,null,null,null,null,null,null,null,null,null,null,null,null,null,null,null,null,null,null,null,null,null,null,null,null,null,{"$f":"'Protocol 1 (5nm)'!BL58:CF58","v":"First, last name of inspector"},null,null,null,null,null,null,null,null,null,null,null,null,null,null,null,null,null,null,null,null,{"$f":"'Protocol 1 (5nm)'!CG58:CX58","v":"Phone number"}]

{"sheet":"Protocol 3","index":2,"n_rows":64,"n_cols":85,"rows_kept":64,"cut":false,"hidden":false,"merged":[[60,0,60,26],[61,0,61,26],[63,0,63,14],[63,15,63,26],[0,0,1,53],[3,0,3,12],[3,13,3,58],[4,13,4,58],[5,13,5,58],[59,0,59,26],[63,63,63,83],[3,84,3,99],[4,62,4,83],[4,84,4,99],[5,84,5,99],[63,84,63,101],[5,62,5,83],[3,62,3,83]]}
[{"$f":"IF(Data!$AE$2=\"DE\",\"Messprotokoll\",IF(Data!$AE$2=\"UK\",\"Measurement protocol\",IF(Data!$AE$2=\"FR\",\"Rapport de mesure\",\"Language Error\")))","v":"Measurement protocol"}]
[]
[]
[{"$f":"IF(Data!$AE$2 = \"DE\", \"Prüfling:\", IF(Data!$AE$2 = \"UK\",\"Test object:\",IF(Data!$AE$2=\"FR\",\"Objet testé:\",\"Language Error\")))","v":"Test object:"},null,null,null,null,null,null,null,null,null,null,null,null,{"$f":"'Protocol 1 (5nm)'!N4:BG4","v":"Manufacturer"},null,null,null,null,null,null,null,null,null,null,null,null,null,null,null,null,null,null,null,null,null,null,null,null,null,null,null,null,null,null,null,null,null,null,null,null,null,null,null,null,null,null,null,null,null,null,null,null,{"$f":"IF(Data!$AE$2=\"DE\",\"Messdatei:\",IF(Data!$AE$2=\"UK\",\"Measurement file:\",IF(Data!$AE$2=\"FR\",\"Fichier de mesure:\",\"Language Error\")))","v":"Measurement file:"},null,null,null,null,null,null,null,null,null,null,null,null,null,null,null,null,null,null,null,null,null,{"$f":"Data!Q18","v":"M_000003.CSV"}]
[null,null,null,null,null,null,null,null,null,null,null,null,null,{"$f":"'Protocol 1 (5nm)'!N5:BG5","v":"Type"},null,null,null,null,null,null,null,null,null,null,null,null,null,null,null,null,null,null,null,null,null,null,null,null,null,null,null,null,null,null,null,null,null,null,null,null,null,null,null,null,null,null,null,null,null,null,null,null,{"$f":"IF(Data!$AE$2=\"DE\",\"Datum der Messung:\",IF(Data!$AE$2=\"UK\",\"Date of measurement:\",IF(Data!$AE$2=\"FR\",\"Date de mesure:\",\"Language Error\")))","v":"Date of measurement:"},null,null,null,null,null,null,null,null,null,null,null,null,null,null,null,null,null,null,null,null,null,{"$f":"Data!Q23","v":"29.04.2024"}]
[null,null,null,null,null,null,null,null,null,null,null,null,null,{"$f":"'Protocol 1 (5nm)'!N6:BG6","v":"Model"},null,null,null,null,null,null,null,null,null,null,null,null,null,null,null,null,null,null,null,null,null,null,null,null,null,null,null,null,null,null,null,null,null,null,null,null,null,null,null,null,null,null,null,null,null,null,null,null,{"$f":"IF(Data!$AE$2=\"DE\",\"Uhrzeit der Messung:\",IF(Data!$AE$2=\"UK\",\"Time of measurement:\",IF(Data!$AE$2=\"FR\",\"Heure de mesure:\",\"Language Error\")))","v":"Time of measurement:"},null,null,null,null,null,null,null,null,null,null,null,null,null,null,null,null,null,null,null,null,null,{"$f":"Data!Q21","v":"08:07:17"}]
[]
[]
[]
[]
[]
[]
[]
[]
[]
[]
[]
[]
[]
[]
[]
[]
[]
[]
[]
[]
[]
[]
[]
[]
[]
[]
[]
[]
[]
[]
[]
[]
[]
[]
[]
[]
[]
[]
[]
[]
[]
[]
[]
[]
[]
[]
[]
[]
[]
[]
[]
[]
[]
[{"$f":"'Protocol 1 (5nm)'!A54:AA54","v":"Company"}]
[{"$f":"'Protocol 1 (5nm)'!A55:AA55","v":"Address"}]
[{"$f":"'Protocol 1 (5nm)'!A56:AA56","v":"ZIP  City"}]
[]
[{"$f":"'Protocol 1 (5nm)'!A58:O58","v":"Test location,"},null,null,null,null,null,null,null,null,null,null,null,null,null,null,{"$f":"'Protocol 1 (5nm)'!P58:AA58","v":"Date"},null,null,null,null,null,null,null,null,null,null,null,null,null,null,null,null,null,null,null,null,null,null,null,null,null,null,null,null,null,null,null,null,null,null,null,null,null,null,null,null,null,null,null,null,null,null,null,{"$f":"'Protocol 1 (5nm)'!BL58:CF58","v":"First, last name of inspector"},null,null,null,null,null,null,null,null,null,null,null,null,null,null,null,null,null,null,null,null,{"$f":"'Protocol 1 (5nm)'!CG58:CX58","v":"Phone number"}]

{"sheet":"Protocol TM30-20","index":3,"n_rows":58,"n_cols":85,"rows_kept":58,"cut":false,"hidden":false,"merged":[[0,0,1,53],[3,84,3,99],[4,62,4,83],[4,84,4,99],[5,84,5,99],[57,63,57,83],[57,84,57,101],[5,62,5,83],[3,0,3,12],[3,13,3,58],[4,13,4,58],[5,13,5,58],[3,62,3,83],[53,0,53,26],[54,0,54,26],[55,0,55,26],[57,0,57,14],[57,15,57,26]]}
[{"$f":"IF(Data!$AE$2=\"DE\",\"Messprotokoll\",IF(Data!$AE$2=\"UK\",\"Measurement protocol\",IF(Data!$AE$2=\"FR\",\"Rapport de mesure\",\"Language Error\")))","v":"Measurement protocol"}]
[]
[]
[{"$f":"IF(Data!$AE$2 = \"DE\", \"Prüfling:\", IF(Data!$AE$2 = \"UK\",\"Test object:\",IF(Data!$AE$2=\"FR\",\"Objet testé:\",\"Language Error\")))","v":"Test object:"},null,null,null,null,null,null,null,null,null,null,null,null,{"$f":"'Protocol 1 (5nm)'!N4:BG4","v":"Manufacturer"},null,null,null,null,null,null,null,null,null,null,null,null,null,null,null,null,null,null,null,null,null,null,null,null,null,null,null,null,null,null,null,null,null,null,null,null,null,null,null,null,null,null,null,null,null,null,null,null,{"$f":"IF(Data!$AE$2=\"DE\",\"Messdatei:\",IF(Data!$AE$2=\"UK\",\"Measurement file:\",IF(Data!$AE$2=\"FR\",\"Fichier de mesure:\",\"Language Error\")))","v":"Measurement file:"},null,null,null,null,null,null,null,null,null,null,null,null,null,null,null,null,null,null,null,null,null,{"$f":"Data!Q18","v":"M_000003.CSV"}]
[null,null,null,null,null,null,null,null,null,null,null,null,null,{"$f":"'Protocol 1 (5nm)'!N5:BG5","v":"Type"},null,null,null,null,null,null,null,null,null,null,null,null,null,null,null,null,null,null,null,null,null,null,null,null,null,null,null,null,null,null,null,null,null,null,null,null,null,null,null,null,null,null,null,null,null,null,null,null,{"$f":"IF(Data!$AE$2=\"DE\",\"Datum der Messung:\",IF(Data!$AE$2=\"UK\",\"Date of measurement:\",IF(Data!$AE$2=\"FR\",\"Date de mesure:\",\"Language Error\")))","v":"Date of measurement:"},null,null,null,null,null,null,null,null,null,null,null,null,null,null,null,null,null,null,null,null,null,{"$f":"Data!Q23","v":"29.04.2024"}]
[null,null,null,null,null,null,null,null,null,null,null,null,null,{"$f":"'Protocol 1 (5nm)'!N6:BG6","v":"Model"},null,null,null,null,null,null,null,null,null,null,null,null,null,null,null,null,null,null,null,null,null,null,null,null,null,null,null,null,null,null,null,null,null,null,null,null,null,null,null,null,null,null,null,null,null,null,null,null,{"$f":"IF(Data!$AE$2=\"DE\",\"Uhrzeit der Messung:\",IF(Data!$AE$2=\"UK\",\"Time of measurement:\",IF(Data!$AE$2=\"FR\",\"Heure de mesure:\",\"Language Error\")))","v":"Time of measurement:"},null,null,null,null,null,null,null,null,null,null,null,null,null,null,null,null,null,null,null,null,null,{"$f":"Data!Q21","v":"08:07:17"}]
[]
[]
[]
[]
[]
[]
[]
[]
[]
[]
[]
[]
[]
[]
[]
[]
[]
[]
[]
[]
[]
[]
[]
[]
[]
[]
[]
[]
[]
[]
[]
[]
[]
[]
[]
[]
[]
[]
[]
[]
[]
[]
[]
[]
[]
[]
[]
[{"$f":"'Protocol 1 (5nm)'!A54:AA54","v":"Company"}]
[{"$f":"'Protocol 1 (5nm)'!A55:AA55","v":"Address"}]
[{"$f":"'Protocol 1 (5nm)'!A56:AA56","v":"ZIP  City"}]
[]
[{"$f":"'Protocol 1 (5nm)'!A58:O58","v":"Test location,"},null,null,null,null,null,null,null,null,null,null,null,null,null,null,{"$f":"'Protocol 1 (5nm)'!P58:AA58","v":"Date"},null,null,null,null,null,null,null,null,null,null,null,null,null,null,null,null,null,null,null,null,null,null,null,null,null,null,null,null,null,null,null,null,null,null,null,null,null,null,null,null,null,null,null,null,null,null,null,{"$f":"'Protocol 1 (5nm)'!BL58:CF58","v":"First, last name of inspector"},null,null,null,null,null,null,null,null,null,null,null,null,null,null,null,null,null,null,null,null,{"$f":"'Protocol 1 (5nm)'!CG58:CX58","v":"Phone number"}]

{"sheet":"Protocol Flicker","index":4,"n_rows":58,"n_cols":85,"rows_kept":58,"cut":false,"hidden":false,"merged":[[4,13,4,58],[4,62,4,83],[4,84,4,99],[0,0,1,53],[3,0,3,12],[3,13,3,58],[3,62,3,83],[3,84,3,99],[5,13,5,58],[5,62,5,83],[5,84,5,99],[53,0,53,26],[54,0,54,26],[57,0,57,14],[57,15,57,26],[57,63,57,83],[57,84,57,101],[22,3,22,33],[22,34,22,50],[23,3,23,33],[23,34,23,50],[24,3,24,33],[24,34,24,50],[55,0,55,26]]}
[{"$f":"IF(Data!$AE$2=\"DE\",\"Messprotokoll\",IF(Data!$AE$2=\"UK\",\"Measurement protocol\",IF(Data!$AE$2=\"FR\",\"Rapport de mesure\",\"Language Error\")))","v":"Measurement protocol"}]
[]
[]
[{"$f":"IF(Data!$AE$2 = \"DE\", \"Prüfling:\", IF(Data!$AE$2 = \"UK\",\"Test object:\",IF(Data!$AE$2=\"FR\",\"Objet testé:\",\"Language Error\")))","v":"Test object:"},null,null,null,null,null,null,null,null,null,null,null,null,{"$f":"'Protocol 1 (5nm)'!N4:BG4","v":"Manufacturer"},null,null,null,null,null,null,null,null,null,null,null,null,null,null,null,null,null,null,null,null,null,null,null,null,null,null,null,null,null,null,null,null,null,null,null,null,null,null,null,null,null,null,null,null,null,null,null,null,{"$f":"IF(Data!$AE$2=\"DE\",\"Messdatei:\",IF(Data!$AE$2=\"UK\",\"Measurement file:\",IF(Data!$AE$2=\"FR\",\"Fichier de mesure:\",\"Language Error\")))","v":"Measurement file:"},null,null,null,null,null,null,null,null,null,null,null,null,null,null,null,null,null,null,null,null,null,{"$f":"Data!Q18","v":"M_000003.CSV"}]
[null,null,null,null,null,null,null,null,null,null,null,null,null,{"$f":"'Protocol 1 (5nm)'!N5:BG5","v":"Type"},null,null,null,null,null,null,null,null,null,null,null,null,null,null,null,null,null,null,null,null,null,null,null,null,null,null,null,null,null,null,null,null,null,null,null,null,null,null,null,null,null,null,null,null,null,null,null,null,{"$f":"IF(Data!$AE$2=\"DE\",\"Datum der Messung:\",IF(Data!$AE$2=\"UK\",\"Date of measurement:\",IF(Data!$AE$2=\"FR\",\"Date de mesure:\",\"Language Error\")))","v":"Date of measurement:"},null,null,null,null,null,null,null,null,null,null,null,null,null,null,null,null,null,null,null,null,null,{"$f":"Data!Q23","v":"29.04.2024"}]
[null,null,null,null,null,null,null,null,null,null,null,null,null,{"$f":"'Protocol 1 (5nm)'!N6:BG6","v":"Model"},null,null,null,null,null,null,null,null,null,null,null,null,null,null,null,null,null,null,null,null,null,null,null,null,null,null,null,null,null,null,null,null,null,null,null,null,null,null,null,null,null,null,null,null,null,null,null,null,{"$f":"IF(Data!$AE$2=\"DE\",\"Uhrzeit der Messung:\",IF(Data!$AE$2=\"UK\",\"Time of measurement:\",IF(Data!$AE$2=\"FR\",\"Heure de mesure:\",\"Language Error\")))","v":"Time of measurement:"},null,null,null,null,null,null,null,null,null,null,null,null,null,null,null,null,null,null,null,null,null,{"$f":"Data!Q21","v":"08:07:17"}]
[]
[]
[]
[]
[]
[]
[]
[]
[]
[]
[]
[]
[]
[]
[]
[]
[null,null,null,{"$f":"IF(Data!$AE$2 = \"DE\", \"Flickerfrequenz\", IF(Data!$AE$2 = \"UK\",\"Flicker frequency\",IF(Data!$AE$2=\"FR\",\"Fréquence flicker\",\"Language Error\")))","v":"Flicker frequency"},null,null,null,null,null,null,null,null,null,null,null,null,null,null,null,null,null,null,null,null,null,null,null,null,null,null,null,null,null,null,{"$f":"Data!K36","v":99.9}]
[null,null,null,{"$f":"IF(Data!$AE$2 = \"DE\", \"Prozent Flicker\", IF(Data!$AE$2 = \"UK\",\"Percent Flicker\",IF(Data!$AE$2=\"FR\",\"% flicker\",\"Language Error\")))","v":"Percent Flicker"},null,null,null,null,null,null,null,null,null,null,null,null,null,null,null,null,null,null,null,null,null,null,null,null,null,null,null,null,null,null,{"$f":"Data!K37","v":17.2}]
[null,null,null,{"$f":"IF(Data!$AE$2 = \"DE\", \"Flickerindex\", IF(Data!$AE$2 = \"UK\",\"Flicker index\",IF(Data!$AE$2=\"FR\",\"Index flicker\",\"Language Error\")))","v":"Flicker index"},null,null,null,null,null,null,null,null,null,null,null,null,null,null,null,null,null,null,null,null,null,null,null,null,null,null,null,null,null,null,{"$f":"Data!K35","v":5.0999999999999997E-2}]
[]
[]
[]
[]
[]
[]
[]
[]
[]
[]
[]
[]
[]
[]
[]
[]
[]
[]
[]
[]
[]
[]
[]
[]
[]
[]
[]
[]
[{"$f":"'Protocol 1 (5nm)'!A54:AA54","v":"Company"}]
[{"$f":"'Protocol 1 (5nm)'!A55:AA55","v":"Address"}]
[{"$f":"'Protocol 1 (5nm)'!A56:AA56","v":"ZIP  City"}]
[]
[{"$f":"'Protocol 1 (5nm)'!A58:O58","v":"Test location,"},null,null,null,null,null,null,null,null,null,null,null,null,null,null,{"$f":"'Protocol 1 (5nm)'!P58:AA58","v":"Date"},null,null,null,null,null,null,null,null,null,null,null,null,null,null,null,null,null,null,null,null,null,null,null,null,null,null,null,null,null,null,null,null,null,null,null,null,null,null,null,null,null,null,null,null,null,null,null,{"$f":"'Protocol 1 (5nm)'!BL58:CF58","v":"First, last name of inspector"},null,null,null,null,null,null,null,null,null,null,null,null,null,null,null,null,null,null,null,null,{"$f":"'Protocol 1 (5nm)'!CG58:CX58","v":"Phone number"}]

{"sheet":"Protocol TLCI","index":5,"n_rows":58,"n_cols":85,"rows_kept":58,"cut":false,"hidden":false,"merged":[[44,64,44,78],[45,64,45,78],[46,64,46,78],[47,64,47,78],[48,64,48,78],[49,64,49,78],[49,79,49,86],[46,36,46,50],[47,36,47,50],[48,36,48,50],[45,79,45,86],[46,79,46,86],[47,79,47,86],[48,79,48,86],[48,59,48,63],[49,59,49,63],[44,59,44,63],[45,59,45,63],[46,59,46,63],[47,59,47,63],[44,79,44,86],[44,3,44,7],[44,8,44,22],[44,23,44,30],[45,23,45,30],[46,23,46,30],[47,23,47,30],[48,23,48,30],[49,23,49,30],[45,3,45,7],[46,3,46,7],[47,3,47,7],[48,3,48,7],[49,3,49,7],[48,8,48,22],[45,8,45,22],[46,8,46,22],[47,8,47,22],[49,8,49,22],[44,31,44,35],[45,31,45,35],[46,31,46,35],[47,31,47,35],[48,31,48,35],[49,31,49,35],[49,36,49,50],[44,51,44,58],[45,51,45,58],[46,51,46,58],[47,51,47,58],[48,51,48,58],[49,51,49,58],[44,36,44,50],[45,36,45,50],[28,28,28,37],[29,28,29,37],[25,18,25,27],[26,18,26,27],[27,18,27,27],[28,18,28,27],[29,18,29,27],[43,59,43,78],[43,79,43,86],[43,23,43,30],[43,3,43,22],[43,31,43,50],[43,51,43,58],[36,28,36,37],[37,28,37,37],[34,3,34,7],[34,8,34,17],[35,3,35,7],[35,8,35,17],[34,18,34,27],[35,18,35,27],[34,28,34,37],[35,28,35,37],[36,3,36,7],[36,8,36,17],[37,3,37,7],[37,8,37,17],[36,18,36,27],[37,18,37,27],[32,28,32,37],[33,28,33,37],[30,3,30,7],[30,8,30,17],[31,3,31,7],[31,8,31,17],[30,18,30,27],[31,18,31,27],[30,28,30,37],[31,28,31,37],[32,3,32,7],[32,8,32,17],[33,3,33,7],[33,8,33,17],[32,18,32,27],[33,18,33,27],[26,8,26,17],[27,3,27,7],[27,8,27,17],[4,13,4,58],[4,62,4,83],[4,84,4,99],[22,3,22,33],[22,34,22,50],[22,54,22,75],[22,76,22,98],[25,28,25,37],[26,28,26,37],[27,28,27,37],[0,0,1,53],[3,0,3,12],[3,13,3,58],[3,62,3,83],[3,84,3,99],[57,0,57,14],[57,15,57,26],[57,63,57,83],[57,84,57,101],[5,13,5,58],[5,62,5,83],[5,84,5,99],[53,0,53,26],[54,0,54,26],[55,0,55,26],[23,3,23,33],[23,34,23,50],[25,3,25,7],[25,8,25,17],[28,3,28,7],[28,8,28,17],[29,3,29,7],[29,8,29,17],[26,3,26,7]]}
[{"$f":"IF(Data!$AE$2=\"DE\",\"Messprotokoll\",IF(Data!$AE$2=\"UK\",\"Measurement protocol\",IF(Data!$AE$2=\"FR\",\"Rapport de mesure\",\"Language Error\")))","v":"Measurement protocol"}]
[]
[]
[{"$f":"IF(Data!$AE$2 = \"DE\", \"Prüfling:\", IF(Data!$AE$2 = \"UK\",\"Test object:\",IF(Data!$AE$2=\"FR\",\"Objet testé:\",\"Language Error\")))","v":"Test object:"},null,null,null,null,null,null,null,null,null,null,null,null,{"$f":"'Protocol 1 (5nm)'!N4:BG4","v":"Manufacturer"},null,null,null,null,null,null,null,null,null,null,null,null,null,null,null,null,null,null,null,null,null,null,null,null,null,null,null,null,null,null,null,null,null,null,null,null,null,null,null,null,null,null,null,null,null,null,null,null,{"$f":"IF(Data!$AE$2=\"DE\",\"Messdatei:\",IF(Data!$AE$2=\"UK\",\"Measurement file:\",IF(Data!$AE$2=\"FR\",\"Fichier de mesure:\",\"Language Error\")))","v":"Measurement file:"},null,null,null,null,null,null,null,null,null,null,null,null,null,null,null,null,null,null,null,null,null,{"$f":"Data!Q18","v":"M_000003.CSV"}]
[null,null,null,null,null,null,null,null,null,null,null,null,null,{"$f":"'Protocol 1 (5nm)'!N5:BG5","v":"Type"},null,null,null,null,null,null,null,null,null,null,null,null,null,null,null,null,null,null,null,null,null,null,null,null,null,null,null,null,null,null,null,null,null,null,null,null,null,null,null,null,null,null,null,null,null,null,null,null,{"$f":"IF(Data!$AE$2=\"DE\",\"Datum der Messung:\",IF(Data!$AE$2=\"UK\",\"Date of measurement:\",IF(Data!$AE$2=\"FR\",\"Date de mesure:\",\"Language Error\")))","v":"Date of measurement:"},null,null,null,null,null,null,null,null,null,null,null,null,null,null,null,null,null,null,null,null,null,{"$f":"Data!Q23","v":"29.04.2024"}]
[null,null,null,null,null,null,null,null,null,null,null,null,null,{"$f":"'Protocol 1 (5nm)'!N6:BG6","v":"Model"},null,null,null,null,null,null,null,null,null,null,null,null,null,null,null,null,null,null,null,null,null,null,null,null,null,null,null,null,null,null,null,null,null,null,null,null,null,null,null,null,null,null,null,null,null,null,null,null,{"$f":"IF(Data!$AE$2=\"DE\",\"Uhrzeit der Messung:\",IF(Data!$AE$2=\"UK\",\"Time of measurement:\",IF(Data!$AE$2=\"FR\",\"Heure de mesure:\",\"Language Error\")))","v":"Time of measurement:"},null,null,null,null,null,null,null,null,null,null,null,null,null,null,null,null,null,null,null,null,null,{"$f":"Data!Q21","v":"08:07:17"}]
[]
[]
[]
[]
[]
[]
[]
[]
[]
[]
[]
[]
[]
[]
[]
[]
[null,null,null,{"$f":"IF(Data!$AE$2 = \"DE\", \"Ähnlichste Farbtemperatur (CCT)\", IF(Data!$AE$2 = \"UK\",\"correlated color temperature (CCT)\",IF(Data!$AE$2=\"FR\",\"Temp. de couleur proximale (CCT)\",\"Language Error\")))","v":"correlated color temperature (CCT)"},null,null,null,null,null,null,null,null,null,null,null,null,null,null,null,null,null,null,null,null,null,null,null,null,null,null,null,null,null,null,{"$f":"Data!K30","v":4014},null,null,null,null,null,null,null,null,null,null,null,null,null,null,null,null,null,null,null,{"$f":"IF(Data!$AE$2 = \"DE\", \"Referenzspektrum\", IF(Data!$AE$2 = \"UK\",\"Referencec Spectrum\",IF(Data!$AE$2=\"FR\",\"Spectre de référence\",\"Language Error\")))","v":"Referencec Spectrum"},null,null,null,null,null,null,null,null,null,null,null,null,null,null,null,null,null,null,null,null,null,{"$f":"Data!Q31","v":"Plank-Daylight Mix"}]
[null,null,null,"TLCI",null,null,null,null,null,null,null,null,null,null,null,null,null,null,null,null,null,null,null,null,null,null,null,null,null,null,null,null,null,null,{"$f":"Data!Q30","v":75}]
[]
[null,null,null,null,null,null,null,null,"Lightness",null,null,null,null,null,null,null,null,null,"Chroma",null,null,null,null,null,null,null,null,null,"Hue"]
[null,null,null,"R",null,null,null,null,{"$f":"Data!Q50","v":3},null,null,null,null,null,null,null,null,null,{"$f":"Data!Q51","v":2},null,null,null,null,null,null,null,null,null,{"$f":"Data!Q52","v":0}]
[null,null,null,"R/Y",null,null,null,null,{"$f":"Data!Q53","v":0},null,null,null,null,null,null,null,null,null,{"$f":"Data!Q54","v":1},null,null,null,null,null,null,null,null,null,{"$f":"Data!Q55","v":-2}]
[null,null,null,"Y",null,null,null,null,{"$f":"Data!Q56","v":0},null,null,null,null,null,null,null,null,null,{"$f":"Data!Q57","v":0},null,null,null,null,null,null,null,null,null,{"$f":"Data!Q58","v":-2}]
[null,null,null,"Y/G",null,null,null,null,{"$f":"Data!Q59","v":0},null,null,null,null,null,null,null,null,null,{"$f":"Data!Q60","v":0},null,null,null,null,null,null,null,null,null,{"$f":"Data!Q61","v":0}]
[null,null,null,"G",null,null,null,null,{"$f":"Data!Q62","v":0},null,null,null,null,null,null,null,null,null,{"$f":"Data!Q63","v":0},null,null,null,null,null,null,null,null,null,{"$f":"Data!Q64","v":1}]
[null,null,null,"G/C",null,null,null,null,{"$f":"Data!Q65","v":0},null,null,null,null,null,null,null,null,null,{"$f":"Data!Q66","v":0},null,null,null,null,null,null,null,null,null,{"$f":"Data!Q67","v":1}]
[null,null,null,"C",null,null,null,null,{"$f":"Data!Q68","v":0},null,null,null,null,null,null,null,null,null,{"$f":"Data!Q69","v":0},null,null,null,null,null,null,null,null,null,{"$f":"Data!Q70","v":1}]
[null,null,null,"C/B",null,null,null,null,{"$f":"Data!Q71","v":1},null,null,null,null,null,null,null,null,null,{"$f":"Data!Q72","v":0},null,null,null,null,null,null,null,null,null,{"$f":"Data!Q73","v":-2}]
[null,null,null,"B",null,null,null,null,{"$f":"Data!Q74","v":0},null,null,null,null,null,null,null,null,null,{"$f":"Data!Q75","v":-1},null,null,null,null,null,null,null,null,null,{"$f":"Data!Q76","v":-1}]
[null,null,null,"B/M",null,null,null,null,{"$f":"Data!Q77","v":1},null,null,null,null,null,null,null,null,null,{"$f":"Data!Q78","v":0},null,null,null,null,null,null,null,null,null,{"$f":"Data!Q79","v":3}]
[null,null,null,"M",null,null,null,null,{"$f":"Data!Q80","v":1},null,null,null,null,null,null,null,null,null,{"$f":"Data!Q81","v":0},null,null,null,null,null,null,null,null,null,{"$f":"Data!Q82","v":3}]
[null,null,null,"M/R",null,null,null,null,{"$f":"Data!Q83","v":4},null,null,null,null,null,null,null,null,null,{"$f":"Data!Q84","v":1},null,null,null,null,null,null,null,null,null,{"$f":"Data!Q85","v":4}]
[]
[]
[]
[]
[]
[null,null,null,{"$f":"IF(Data!$AE$2 = \"DE\", \"Testfarbe\", IF(Data!$AE$2 = \"UK\",\"Test Colour\",IF(Data!$AE$2=\"FR\",\"Couleur de test\",\"Language Error\")))","v":"Test Colour"},null,null,null,null,null,null,null,null,null,null,null,null,null,null,null,null,null,null,null,{"$f":"IF(Data!$AE$2 = \"DE\", \"Wert\", IF(Data!$AE$2 = \"UK\",\"Value\",IF(Data!$AE$2=\"FR\",\"Valeur\",\"Language Error\")))","v":"Value"},null,null,null,null,null,null,null,{"$f":"IF(Data!$AE$2 = \"DE\", \"Testfarbe\", IF(Data!$AE$2 = \"UK\",\"Test Colour\",IF(Data!$AE$2=\"FR\",\"Couleur de test\",\"Language Error\")))","v":"Test Colour"},null,null,null,null,null,null,null,null,null,null,null,null,null,null,null,null,null,null,null,{"$f":"IF(Data!$AE$2 = \"DE\", \"Wert\", IF(Data!$AE$2 = \"UK\",\"Value\",IF(Data!$AE$2=\"FR\",\"Valeur\",\"Language Error\")))","v":"Value"},null,null,null,null,null,null,null,{"$f":"IF(Data!$AE$2 = \"DE\", \"Testfarbe\", IF(Data!$AE$2 = \"UK\",\"Test Colour\",IF(Data!$AE$2=\"FR\",\"Couleur de test\",\"Language Error\")))","v":"Test Colour"},null,null,null,null,null,null,null,null,null,null,null,null,null,null,null,null,null,null,null,{"$f":"IF(Data!$AE$2 = \"DE\", \"Wert\", IF(Data!$AE$2 = \"UK\",\"Value\",IF(Data!$AE$2=\"FR\",\"Valeur\",\"Language Error\")))","v":"Value"}]
[null,null,null,"Q1",null,null,null,null,"Dark skin",null,null,null,null,null,null,null,null,null,null,null,null,null,null,{"$f":"Data!Q32","v":80},null,null,null,null,null,null,null,"Q7",null,null,null,null,"Orange",null,null,null,null,null,null,null,null,null,null,null,null,null,null,{"$f":"Data!Q38","v":95},null,null,null,null,null,null,null,"Q13",null,null,null,null,"Blue",null,null,null,null,null,null,null,null,null,null,null,null,null,null,{"$f":"Data!Q44","v":83}]
[null,null,null,"Q2",null,null,null,null,"Light skin",null,null,null,null,null,null,null,null,null,null,null,null,{"$f":"Data!Q33","v":86},null,{"$f":"Data!Q33","v":86},null,null,null,null,null,null,null,"Q8",null,null,null,null,"Purplish blue",null,null,null,null,null,null,null,null,null,null,null,null,null,null,{"$f":"Data!Q39","v":86},null,null,null,null,null,null,null,"Q14",null,null,null,null,"Green",null,null,null,null,null,null,null,null,null,null,null,null,null,null,{"$f":"Data!Q45","v":92}]
[null,null,null,"Q3",null,null,null,null,"Blue sky",null,null,null,null,null,null,null,null,null,null,null,null,{"$f":"Data!Q34","v":86},null,{"$f":"Data!Q34","v":86},null,null,null,null,null,null,null,"Q9",null,null,null,null,"Moderate red",null,null,null,null,null,null,null,null,null,null,null,null,null,null,{"$f":"Data!Q40","v":96},null,null,null,null,null,null,null,"Q15",null,null,null,null,"Red",null,null,null,null,null,null,null,null,null,null,null,null,null,null,{"$f":"Data!Q46","v":93}]
[null,null,null,"Q4",null,null,null,null,"Foliage",null,null,null,null,null,null,null,null,null,null,null,null,{"$f":"Data!Q35","v":89},null,{"$f":"Data!Q35","v":89},null,null,null,null,null,null,null,"Q10",null,null,null,null,"Purple",null,null,null,null,null,null,null,null,null,null,null,null,null,null,{"$f":"Data!Q41","v":85},null,null,null,null,null,null,null,"Q16",null,null,null,null,"Yellow",null,null,null,null,null,null,null,null,null,null,null,null,null,null,{"$f":"Data!Q47","v":50}]
[null,null,null,"Q5",null,null,null,null,"Blue flower",null,null,null,null,null,null,null,null,null,null,null,null,{"$f":"Data!Q36","v":99},null,{"$f":"Data!Q36","v":99},null,null,null,null,null,null,null,"Q11",null,null,null,null,"Yellow green",null,null,null,null,null,null,null,null,null,null,null,null,null,null,{"$f":"Data!Q42","v":58},null,null,null,null,null,null,null,"Q17",null,null,null,null,"Magenta",null,null,null,null,null,null,null,null,null,null,null,null,null,null,{"$f":"Data!Q48","v":93}]
[null,null,null,"Q6",null,null,null,null,"Bluish green",null,null,null,null,null,null,null,null,null,null,null,null,{"$f":"Data!Q37","v":76},null,{"$f":"Data!Q37","v":76},null,null,null,null,null,null,null,"Q12",null,null,null,null,"Orange yellow",null,null,null,null,null,null,null,null,null,null,null,null,null,null,{"$f":"Data!Q43","v":96},null,null,null,null,null,null,null,"Q18",null,null,null,null,"Cyan",null,null,null,null,null,null,null,null,null,null,null,null,null,null,{"$f":"Data!Q49","v":51}]
[]
[]
[]
[{"$f":"'Protocol 1 (5nm)'!A54:AA54","v":"Company"}]
[{"$f":"'Protocol 1 (5nm)'!A55:AA55","v":"Address"}]
[{"$f":"'Protocol 1 (5nm)'!A56:AA56","v":"ZIP  City"}]
[]
[{"$f":"'Protocol 1 (5nm)'!A58:O58","v":"Test location,"},null,null,null,null,null,null,null,null,null,null,null,null,null,null,{"$f":"'Protocol 1 (5nm)'!P58:AA58","v":"Date"},null,null,null,null,null,null,null,null,null,null,null,null,null,null,null,null,null,null,null,null,null,null,null,null,null,null,null,null,null,null,null,null,null,null,null,null,null,null,null,null,null,null,null,null,null,null,null,{"$f":"'Protocol 1 (5nm)'!BL58:CF58","v":"First, last name of inspector"},null,null,null,null,null,null,null,null,null,null,null,null,null,null,null,null,null,null,null,null,{"$f":"'Protocol 1 (5nm)'!CG58:CX58","v":"Phone number"}]

{"sheet":"Protocol PPFD","index":6,"n_rows":56,"n_cols":85,"rows_kept":56,"cut":false,"hidden":false,"merged":[[32,3,32,33],[32,34,32,50],[33,3,33,33],[33,34,33,50],[34,3,34,33],[34,34,34,50],[30,3,30,33],[30,34,30,50],[31,3,31,33],[31,34,31,50],[25,3,25,33],[25,34,25,50],[26,3,26,33],[26,34,26,50],[27,3,27,33],[27,34,27,50],[51,0,51,26],[52,0,52,26],[53,0,53,26],[55,0,55,14],[55,15,55,26],[55,63,55,83],[55,84,55,101],[28,3,28,33],[28,34,28,50],[24,3,24,33],[24,34,24,50],[23,3,23,33],[23,34,23,50],[5,13,5,58],[5,62,5,83],[5,84,5,99],[22,3,22,33],[22,34,22,50],[0,0,1,53],[3,0,3,12],[3,13,3,58],[3,62,3,83],[3,84,3,99],[4,13,4,58],[4,62,4,83],[4,84,4,99]]}
[{"$f":"IF(Data!$AE$2=\"DE\",\"Messprotokoll\",IF(Data!$AE$2=\"UK\",\"Measurement protocol\",IF(Data!$AE$2=\"FR\",\"Rapport de mesure\",\"Language Error\")))","v":"Measurement protocol"}]
[]
[]
[{"$f":"IF(Data!$AE$2 = \"DE\", \"Prüfling:\", IF(Data!$AE$2 = \"UK\",\"Test object:\",IF(Data!$AE$2=\"FR\",\"Objet testé:\",\"Language Error\")))","v":"Test object:"},null,null,null,null,null,null,null,null,null,null,null,null,{"$f":"'Protocol 1 (5nm)'!N4:BG4","v":"Manufacturer"},null,null,null,null,null,null,null,null,null,null,null,null,null,null,null,null,null,null,null,null,null,null,null,null,null,null,null,null,null,null,null,null,null,null,null,null,null,null,null,null,null,null,null,null,null,null,null,null,{"$f":"IF(Data!$AE$2=\"DE\",\"Messdatei:\",IF(Data!$AE$2=\"UK\",\"Measurement file:\",IF(Data!$AE$2=\"FR\",\"Fichier de mesure:\",\"Language Error\")))","v":"Measurement file:"},null,null,null,null,null,null,null,null,null,null,null,null,null,null,null,null,null,null,null,null,null,{"$f":"Data!Q18","v":"M_000003.CSV"}]
[null,null,null,null,null,null,null,null,null,null,null,null,null,{"$f":"'Protocol 1 (5nm)'!N5:BG5","v":"Type"},null,null,null,null,null,null,null,null,null,null,null,null,null,null,null,null,null,null,null,null,null,null,null,null,null,null,null,null,null,null,null,null,null,null,null,null,null,null,null,null,null,null,null,null,null,null,null,null,{"$f":"IF(Data!$AE$2=\"DE\",\"Datum der Messung:\",IF(Data!$AE$2=\"UK\",\"Date of measurement:\",IF(Data!$AE$2=\"FR\",\"Date de mesure:\",\"Language Error\")))","v":"Date of measurement:"},null,null,null,null,null,null,null,null,null,null,null,null,null,null,null,null,null,null,null,null,null,{"$f":"Data!Q23","v":"29.04.2024"}]
[null,null,null,null,null,null,null,null,null,null,null,null,null,{"$f":"'Protocol 1 (5nm)'!N6:BG6","v":"Model"},null,null,null,null,null,null,null,null,null,null,null,null,null,null,null,null,null,null,null,null,null,null,null,null,null,null,null,null,null,null,null,null,null,null,null,null,null,null,null,null,null,null,null,null,null,null,null,null,{"$f":"IF(Data!$AE$2=\"DE\",\"Uhrzeit der Messung:\",IF(Data!$AE$2=\"UK\",\"Time of measurement:\",IF(Data!$AE$2=\"FR\",\"Heure de mesure:\",\"Language Error\")))","v":"Time of measurement:"},null,null,null,null,null,null,null,null,null,null,null,null,null,null,null,null,null,null,null,null,null,{"$f":"Data!Q21","v":"08:07:17"}]
[]
[]
[]
[]
[]
[]
[]
[]
[]
[]
[]
[]
[]
[]
[]
[]
[null,null,null,{"$f":"IF(Data!$AE$2=\"DE\",\"Beleuchtungsstärke\",IF(Data!$AE$2=\"UK\",\"Illuminance\",IF(Data!$AE$2=\"FR\",\"Illuminance\",\"Language Error\")))","v":"Illuminance"},null,null,null,null,null,null,null,null,null,null,null,null,null,null,null,null,null,null,null,null,null,null,null,null,null,null,null,null,null,null,{"$f":"Data!K33","v":3202.16}]
[null,null,null,"PPFD",null,null,null,null,null,null,null,null,null,null,null,null,null,null,null,null,null,null,null,null,null,null,null,null,null,null,null,null,null,null,{"$f":"Data!K158 & \" µmol/m²s\"","v":"45,52 µmol/m²s"}]
[null,null,null,"PPFD UV",null,null,null,null,null,null,null,null,null,null,null,null,null,null,null,null,null,null,null,null,null,null,null,null,null,null,null,null,null,null,{"$f":"Data!K159 & \" µmol/m²s\"","v":"0,07 µmol/m²s"}]
[null,null,null,{"$f":"IF(Data!$AE$2=\"DE\",\"PPFD Blau\",IF(Data!$AE$2=\"UK\",\"PPFD Blue\",IF(Data!$AE$2=\"FR\",\"PPFD Bleu\",\"Language Error\")))","v":"PPFD Blue"},null,null,null,null,null,null,null,null,null,null,null,null,null,null,null,null,null,null,null,null,null,null,null,null,null,null,null,null,null,null,{"$f":"Data!K161 & \" µmol/m²s\"","v":"7,94 µmol/m²s"}]
[null,null,null,{"$f":"IF(Data!$AE$2=\"DE\",\"PPFD Grün\",IF(Data!$AE$2=\"UK\",\"PPFD Green\",IF(Data!$AE$2=\"FR\",\"PPFD Vert\",\"Language Error\")))","v":"PPFD Green"},null,null,null,null,null,null,null,null,null,null,null,null,null,null,null,null,null,null,null,null,null,null,null,null,null,null,null,null,null,null,{"$f":"Data!K163 & \" µmol/m²s\"","v":"20,51 µmol/m²s"}]
[null,null,null,{"$f":"IF(Data!$AE$2=\"DE\",\"PPFD Rot\",IF(Data!$AE$2=\"UK\",\"PPFD Red\",IF(Data!$AE$2=\"FR\",\"PPFD Rouge\",\"Language Error\")))","v":"PPFD Red"},null,null,null,null,null,null,null,null,null,null,null,null,null,null,null,null,null,null,null,null,null,null,null,null,null,null,null,null,null,null,{"$f":"Data!K165 & \" µmol/m²s\"","v":"17,07 µmol/m²s"}]
[null,null,null,"PPFD FR",null,null,null,null,null,null,null,null,null,null,null,null,null,null,null,null,null,null,null,null,null,null,null,null,null,null,null,null,null,null,{"$f":"Data!K166 & \" µmol/m²s\"","v":"5,15 µmol/m²s"}]
[]
[null,null,null,"% PPFD UV",null,null,null,null,null,null,null,null,null,null,null,null,null,null,null,null,null,null,null,null,null,null,null,null,null,null,null,null,null,null,{"$f":"Data!K159/Data!K158","v":1.5377855887521968E-3}]
[null,null,null,{"$f":"IF(Data!$AE$2=\"DE\",\"% PPFD Blau\",IF(Data!$AE$2=\"UK\",\"% PPFD Blue\",IF(Data!$AE$2=\"FR\",\"% PPFD Bleu\",\"Language Error\")))","v":"% PPFD Blue"},null,null,null,null,null,null,null,null,null,null,null,null,null,null,null,null,null,null,null,null,null,null,null,null,null,null,null,null,null,null,{"$f":"Data!K161/Data!K158","v":0.17442882249560632}]
[null,null,null,{"$f":"IF(Data!$AE$2=\"DE\",\"% PPFD Grün\",IF(Data!$AE$2=\"UK\",\"% PPFD Green\",IF(Data!$AE$2=\"FR\",\"% PPFD Vert\",\"Language Error\")))","v":"% PPFD Green"},null,null,null,null,null,null,null,null,null,null,null,null,null,null,null,null,null,null,null,null,null,null,null,null,null,null,null,null,null,null,{"$f":"Data!K163/Data!K158","v":0.45057117750439368}]
[null,null,null,{"$f":"IF(Data!$AE$2=\"DE\",\"% PPFD Rot\",IF(Data!$AE$2=\"UK\",\"% PPFD Red\",IF(Data!$AE$2=\"FR\",\"% PPFD Rouge\",\"Language Error\")))","v":"% PPFD Red"},null,null,null,null,null,null,null,null,null,null,null,null,null,null,null,null,null,null,null,null,null,null,null,null,null,null,null,null,null,null,{"$f":"Data!K165/Data!K158","v":0.375}]
[null,null,null,"% PPFD FR",null,null,null,null,null,null,null,null,null,null,null,null,null,null,null,null,null,null,null,null,null,null,null,null,null,null,null,null,null,null,{"$f":"Data!K166/Data!K158","v":0.11313708260105448}]
[]
[]
[]
[]
[]
[]
[]
[]
[]
[]
[]
[]
[]
[]
[]
[]
[{"$f":"'Protocol 1 (5nm)'!A54:AA54","v":"Company"}]
[{"$f":"'Protocol 1 (5nm)'!A55:AA55","v":"Address"}]
[{"$f":"'Protocol 1 (5nm)'!A56:AA56","v":"ZIP  City"}]
[]
[{"$f":"'Protocol 1 (5nm)'!A58:O58","v":"Test location,"},null,null,null,null,null,null,null,null,null,null,null,null,null,null,{"$f":"'Protocol 1 (5nm)'!P58:AA58","v":"Date"},null,null,null,null,null,null,null,null,null,null,null,null,null,null,null,null,null,null,null,null,null,null,null,null,null,null,null,null,null,null,null,null,null,null,null,null,null,null,null,null,null,null,null,null,null,null,null,{"$f":"'Protocol 1 (5nm)'!BL58:CF58","v":"First, last name of inspector"},null,null,null,null,null,null,null,null,null,null,null,null,null,null,null,null,null,null,null,null,{"$f":"'Protocol 1 (5nm)'!CG58:CX58","v":"Phone number"}]

{"sheet":"Reference Comparison","index":7,"n_rows":55,"n_cols":92,"rows_kept":55,"cut":false,"hidden":false,"merged":[[54,84,54,101],[50,0,50,26],[51,0,51,26],[52,0,52,26],[54,0,54,14],[54,15,54,26],[54,63,54,83],[44,36,44,65],[44,66,44,77],[44,78,44,90],[44,91,44,101],[45,36,45,65],[45,66,45,77],[45,78,45,90],[45,91,45,101],[45,1,45,5],[45,6,45,15],[45,16,45,28],[45,29,45,34],[42,78,42,90],[42,91,42,101],[43,1,43,5],[43,6,43,15],[43,16,43,28],[43,29,43,34],[43,36,43,65],[43,66,43,77],[43,78,43,90],[43,91,43,101],[42,1,42,5],[42,6,42,15],[42,16,42,28],[42,29,42,34],[42,36,42,65],[42,66,42,77],[40,78,40,90],[40,91,40,101],[41,36,41,65],[41,66,41,77],[41,78,41,90],[41,91,41,101],[40,1,40,5],[40,6,40,15],[40,16,40,28],[40,29,40,34],[40,36,40,65],[40,66,40,77],[38,78,38,90],[38,91,38,101],[39,1,39,5],[39,6,39,15],[39,16,39,28],[39,29,39,34],[37,36,37,65],[37,66,37,77],[37,78,37,90],[37,91,37,101],[38,1,38,5],[38,6,38,15],[38,16,38,28],[38,29,38,34],[38,36,38,65],[38,66,38,77],[36,1,36,5],[36,6,36,15],[36,16,36,28],[36,29,36,34],[37,1,37,5],[37,6,37,15],[37,16,37,28],[37,29,37,34],[34,78,34,90],[34,91,34,101],[35,1,35,5],[35,6,35,15],[35,16,35,28],[35,29,35,34],[35,36,35,65],[35,66,35,77],[35,78,35,90],[35,91,35,101],[34,1,34,5],[34,6,34,15],[34,16,34,28],[34,29,34,34],[34,36,34,65],[34,66,34,77],[32,36,32,65],[32,66,32,77],[32,78,32,90],[32,91,32,101],[33,1,33,5],[33,6,33,15],[33,16,33,28],[33,29,33,34],[31,1,31,5],[31,6,31,15],[31,16,31,28],[31,29,31,34],[32,1,32,5],[32,6,32,15],[32,16,32,28],[32,29,32,34],[29,78,29,90],[29,91,29,101],[30,1,30,5],[30,6,30,15],[30,16,30,28],[30,29,30,34],[30,36,30,65],[30,66,30,77],[30,78,30,90],[30,91,30,101],[29,1,29,5],[29,6,29,15],[29,16,29,28],[29,29,29,34],[29,36,29,65],[29,66,29,77],[27,78,27,90],[27,91,27,101],[28,1,28,5],[28,6,28,15],[28,16,28,28],[28,29,28,34],[27,1,27,5],[27,6,27,15],[27,16,27,28],[27,29,27,34],[27,36,27,65],[27,66,27,77],[25,78,25,90],[25,91,25,101],[26,1,26,5],[26,6,26,15],[26,16,26,28],[26,29,26,34],[26,36,26,65],[26,66,26,77],[26,78,26,90],[26,91,26,101],[25,1,25,5],[25,6,25,15],[25,16,25,28],[25,29,25,34],[25,36,25,65],[25,66,25,77],[8,62,8,83],[8,84,8,99],[24,1,24,5],[24,6,24,15],[24,16,24,28],[24,29,24,34],[24,36,24,65],[24,66,24,77],[24,78,24,90],[24,91,24,101],[5,13,5,58],[5,62,5,83],[5,84,5,99],[6,62,6,83],[6,84,6,99],[7,62,7,83],[7,84,7,99],[0,0,1,53],[3,0,3,12],[3,13,3,58],[3,62,3,83],[3,84,3,99],[4,13,4,58],[4,62,4,83],[4,84,4,99]]}
[{"$f":"IF(Data!$AE$2=\"DE\",\"Messprotokoll\",IF(Data!$AE$2=\"UK\",\"Measurement protocol\",IF(Data!$AE$2=\"FR\",\"Rapport de mesure\",\"Language Error\")))","v":"Measurement protocol"}]
[]
[]
[{"$f":"IF(Data!$AE$2 = \"DE\", \"Prüfling:\", IF(Data!$AE$2 = \"UK\",\"Test object:\",IF(Data!$AE$2=\"FR\",\"Objet testé:\",\"Language Error\")))","v":"Test object:"},null,null,null,null,null,null,null,null,null,null,null,null,{"$f":"'Protocol 1 (5nm)'!N4:BG4","v":"Manufacturer"},null,null,null,null,null,null,null,null,null,null,null,null,null,null,null,null,null,null,null,null,null,null,null,null,null,null,null,null,null,null,null,null,null,null,null,null,null,null,null,null,null,null,null,null,null,null,null,null,{"$f":"IF(Data!$AE$2=\"DE\",\"Messdatei:\",IF(Data!$AE$2=\"UK\",\"Measurement file:\",IF(Data!$AE$2=\"FR\",\"Fichier de mesure:\",\"Language Error\")))","v":"Measurement file:"},null,null,null,null,null,null,null,null,null,null,null,null,null,null,null,null,null,null,null,null,null,{"$f":"Data!Q18","v":"M_000003.CSV"}]
[null,null,null,null,null,null,null,null,null,null,null,null,null,{"$f":"'Protocol 1 (5nm)'!N5:BG5","v":"Type"},null,null,null,null,null,null,null,null,null,null,null,null,null,null,null,null,null,null,null,null,null,null,null,null,null,null,null,null,null,null,null,null,null,null,null,null,null,null,null,null,null,null,null,null,null,null,null,null,{"$f":"IF(Data!$AE$2=\"DE\",\"Datum der Messung:\",IF(Data!$AE$2=\"UK\",\"Date of measurement:\",IF(Data!$AE$2=\"FR\",\"Date de mesure:\",\"Language Error\")))","v":"Date of measurement:"},null,null,null,null,null,null,null,null,null,null,null,null,null,null,null,null,null,null,null,null,null,{"$f":"Data!Q23","v":"29.04.2024"}]
[null,null,null,null,null,null,null,null,null,null,null,null,null,{"$f":"'Protocol 1 (5nm)'!N6:BG6","v":"Model"},null,null,null,null,null,null,null,null,null,null,null,null,null,null,null,null,null,null,null,null,null,null,null,null,null,null,null,null,null,null,null,null,null,null,null,null,null,null,null,null,null,null,null,null,null,null,null,null,{"$f":"IF(Data!$AE$2=\"DE\",\"Uhrzeit der Messung:\",IF(Data!$AE$2=\"UK\",\"Time of measurement:\",IF(Data!$AE$2=\"FR\",\"Heure de mesure:\",\"Language Error\")))","v":"Time of measurement:"},null,null,null,null,null,null,null,null,null,null,null,null,null,null,null,null,null,null,null,null,null,{"$f":"Data!Q21","v":"08:07:17"}]
[null,null,null,null,null,null,null,null,null,null,null,null,null,null,null,null,null,null,null,null,null,null,null,null,null,null,null,null,null,null,null,null,null,null,null,null,null,null,null,null,null,null,null,null,null,null,null,null,null,null,null,null,null,null,null,null,null,null,null,null,null,null,{"$f":"IF(Data!$AE$2=\"DE\",\"Referenzdatei:\",IF(Data!$AE$2=\"UK\",\"Reference file:\",IF(Data!$AE$2=\"FR\",\"Fichier de référence:\",\"Language Error\")))","v":"Reference file:"},null,null,null,null,null,null,null,null,null,null,null,null,null,null,null,null,null,null,null,null,null,{"$f":"Data!AC18","v":"M_000004.CSV"}]
[null,null,null,null,null,null,null,null,null,null,null,null,null,null,null,null,null,null,null,null,null,null,null,null,null,null,null,null,null,null,null,null,null,null,null,null,null,null,null,null,null,null,null,null,null,null,null,null,null,null,null,null,null,null,null,null,null,null,null,null,null,null,{"$f":"IF(Data!$AE$2=\"DE\",\"Datum der Messung:\",IF(Data!$AE$2=\"UK\",\"Date of measurement:\",IF(Data!$AE$2=\"FR\",\"Date de mesure:\",\"Language Error\")))","v":"Date of measurement:"},null,null,null,null,null,null,null,null,null,null,null,null,null,null,null,null,null,null,null,null,null,{"$f":"Data!AC23","v":"29.04.2024"}]
[null,null,null,null,null,null,null,null,null,null,null,null,null,null,null,null,null,null,null,null,null,null,null,null,null,null,null,null,null,null,null,null,null,null,null,null,null,null,null,null,null,null,null,null,null,null,null,null,null,null,null,null,null,null,null,null,null,null,null,null,null,null,{"$f":"IF(Data!$AE$2=\"DE\",\"Uhrzeit der Messung:\",IF(Data!$AE$2=\"UK\",\"Time of measurement:\",IF(Data!$AE$2=\"FR\",\"Heure de mesure:\",\"Language Error\")))","v":"Time of measurement:"},null,null,null,null,null,null,null,null,null,null,null,null,null,null,null,null,null,null,null,null,null,{"$f":"Data!AC21","v":"08:18:37"}]
[]
[]
[]
[]
[]
[]
[]
[]
[]
[]
[]
[]
[]
[]
[]
[null,null,null,null,null,null,{"$f":"Data!$AB$18","v":"reference"},null,null,null,null,null,null,null,null,null,{"$f":"Data!$P$18","v":"measurement"},null,null,null,null,null,null,null,null,null,null,null,null,"Δ",null,null,null,null,null,null,null,null,null,null,null,null,null,null,null,null,null,null,null,null,null,null,null,null,null,null,null,null,null,null,null,null,null,null,null,null,{"$f":"Data!$AB$18","v":"reference"},null,null,null,null,null,null,null,null,null,null,null,{"$f":"Data!$P$18","v":"measurement"},null,null,null,null,null,null,null,null,null,null,null,null,"Δ"]
[null,"Ra",null,null,null,null,{"$f":"Data!W1","v":97.6},null,null,null,null,null,null,null,null,null,{"$f":"Data!K1","v":84.72},null,null,null,null,null,null,null,null,null,null,null,null,{"$f":"Q26-G26","v":-12.879999999999995},null,null,null,null,null,null,{"$f":"IF(Data!$AE$2=\"DE\",\"Beleuchtungsstärke\",IF(Data!$AE$2=\"UK\",\"Illuminance\",IF(Data!$AE$2=\"FR\",\"Illuminance\",\"Language Error\")))","v":"Illuminance"},null,null,null,null,null,null,null,null,null,null,null,null,null,null,null,null,null,null,null,null,null,null,null,null,null,null,null,null,null,{"$f":"Data!W33","v":2469.94},null,null,null,null,null,null,null,null,null,null,null,{"$f":"Data!K33","v":3202.16},null,null,null,null,null,null,null,null,null,null,null,null,{"$f":"CA26-BO26","v":732.2199999999998}]
[null,"R1",null,null,null,null,{"$f":"Data!W2","v":97.11},null,null,null,null,null,null,null,null,null,{"$f":"Data!K2","v":82.78},null,null,null,null,null,null,null,null,null,null,null,null,{"$f":"Q27-G27","v":-14.329999999999998},null,null,null,null,null,null,"Ee",null,null,null,null,null,null,null,null,null,null,null,null,null,null,null,null,null,null,null,null,null,null,null,null,null,null,null,null,null,{"$f":"Data!AC25","v":11.76},null,null,null,null,null,null,null,null,null,null,null,{"$f":"Data!Q25","v":10.564},null,null,null,null,null,null,null,null,null,null,null,null,{"$f":"CA27-BO27","v":-1.1959999999999997}]
[null,"R2",null,null,null,null,{"$f":"Data!W3","v":98.31},null,null,null,null,null,null,null,null,null,{"$f":"Data!K3","v":90.11},null,null,null,null,null,null,null,null,null,null,null,null,-8.2000000000000028,null,null,null,null,null,null,"LER",null,null,null,null,null,null,null,null,null,null,null,null,null,null,null,null,null,null,null,null,null,null,null,null,null,null,null,null,null,{"$f":"Data!AC26","v":210},null,null,null,null,null,null,null,null,null,null,null,{"$f":"Data!Q26","v":303.10000000000002},null,null,null,null,null,null,null,null,null,null,null,null,{"$f":"CA28-BO28","v":93.100000000000023}]
[null,"R3",null,null,null,null,{"$f":"Data!W4","v":98.94},null,null,null,null,null,null,null,null,null,{"$f":"Data!K4","v":95.97},null,null,null,null,null,null,null,null,null,null,null,null,-2.9699999999999989]
[null,"R4",null,null,null,null,{"$f":"Data!W5","v":96.5},null,null,null,null,null,null,null,null,null,{"$f":"Data!K5","v":83.5},null,null,null,null,null,null,null,null,null,null,null,null,-13,null,null,null,null,null,null,{"$f":"IF(Data!$AE$2 = \"DE\", \"Ähnlichste Farbtemperatur (CCT)\", IF(Data!$AE$2 = \"UK\",\"correlated color temperature (CCT)\",IF(Data!$AE$2=\"FR\",\"temp. de couleur proximale (CCT)\",\"Language Error\")))","v":"correlated color temperature (CCT)"},null,null,null,null,null,null,null,null,null,null,null,null,null,null,null,null,null,null,null,null,null,null,null,null,null,null,null,null,null,{"$f":"Data!W30","v":5126},null,null,null,null,null,null,null,null,null,null,null,{"$f":"Data!K30","v":4014},null,null,null,null,null,null,null,null,null,null,null,null,{"$f":"CA30-BO30","v":-1112}]
[null,"R5",null,null,null,null,{"$f":"Data!W6","v":97.12},null,null,null,null,null,null,null,null,null,{"$f":"Data!K6","v":82.71},null,null,null,null,null,null,null,null,null,null,null,null,-14.410000000000011,null,null,null,null,null,null,"Duv",null,null,null,null,null,null,null,null,null,null,null,null,null,null,null,null,null,null,null,null,null,null,null,null,null,null,null,null,null,{"$f":"Data!W31","v":7.0000000000000001E-3},null,null,null,null,null,null,null,null,null,null,null,{"$f":"Data!K31","v":3.0000000000000001E-3},null,null,null,null,null,null,null,null,null,null,null,null,{"$f":"CA31-BO31","v":-4.0000000000000001E-3}]
[null,"R6",null,null,null,null,{"$f":"Data!W7","v":98.12},null,null,null,null,null,null,null,null,null,{"$f":"Data!K7","v":86.5},null,null,null,null,null,null,null,null,null,null,null,null,-11.620000000000005]
[null,"R7",null,null,null,null,{"$f":"Data!W8","v":98.39},null,null,null,null,null,null,null,null,null,{"$f":"Data!K8","v":88.13},null,null,null,null,null,null,null,null,null,null,null,null,-10.260000000000005,null,null,null,null,null,null,{"$f":"IF(Data!$AE$2 = \"DE\", \"Farbreinheit\",IF(Data!$AE$2 = \"UK\",\"Saturation\",IF(Data!$AE$2=\"FR\",\"Saturation\",\"Language Error\")))","v":"Saturation"},null,null,null,null,null,null,null,null,null,null,null,null,null,null,null,null,null,null,null,null,null,null,null,null,null,null,null,null,null,{"$f":"Data!W39/100","v":0.12},null,null,null,null,null,null,null,null,null,null,null,{"$f":"Data!K39/100","v":0.29899999999999999},null,null,null,null,null,null,null,null,null,null,null,null,{"$f":"CA33-BO33","v":0.17899999999999999}]
[null,"R8",null,null,null,null,{"$f":"Data!W9","v":96.29},null,null,null,null,null,null,null,null,null,{"$f":"Data!K9","v":68.09},null,null,null,null,null,null,null,null,null,null,null,null,-28.200000000000003]
[null,"R9",null,null,null,null,{"$f":"Data!W10","v":90.19},null,null,null,null,null,null,null,null,null,{"$f":"Data!K10","v":17.21},null,null,null,null,null,null,null,null,null,null,null,null,-72.97999999999999,null,null,null,null,null,null,{"$f":"IF(Data!$AE$2 = \"DE\", \"Dominante Wellenlänge\", IF(Data!$AE$2 = \"UK\", \"Dominant wavelength\",IF(Data!$AE$2=\"FR\",\"Longueur d'onde dominante (λD)\",\"Language Error\")))","v":"Dominant wavelength"},null,null,null,null,null,null,null,null,null,null,null,null,null,null,null,null,null,null,null,null,null,null,null,null,null,null,null,null,null,{"$f":"Data!W40","v":565},null,null,null,null,null,null,null,null,null,null,null,{"$f":"Data!K40","v":577},null,null,null,null,null,null,null,null,null,null,null,null,{"$f":"CA35-BO35","v":12}]
[null,"R10",null,null,null,null,{"$f":"Data!W11","v":97.04},null,null,null,null,null,null,null,null,null,{"$f":"Data!K11","v":76.650000000000006},null,null,null,null,null,null,null,null,null,null,null,null,-20.39,null,null,null,null,null,null,{"$f":"IF(Data!$AE$2 = \"DE\", \"Peak-Wellenlänge\",IF(Data!$AE$2 = \"UK\", \"Peak wavelength\",IF(Data!$AE$2=\"FR\",\"Pic courbe spectrale (λP)\",\"Language Error\")))","v":"Peak wavelength"},null,null,null,null,null,null,null,null,null,null,null,null,null,null,null,null,null,null,null,null,null,null,null,null,null,null,null,null,null,{"$f":"Data!W20","v":535},null,null,null,null,null,null,null,null,null,null,null,{"$f":"Data!K20","v":595},null,null,null,null,null,null,null,null,null,null,null,null,{"$f":"CA36-BO36","v":60}]
[null,"R11",null,null,null,null,{"$f":"Data!W12","v":96.22},null,null,null,null,null,null,null,null,null,{"$f":"Data!K12","v":82.47},null,null,null,null,null,null,null,null,null,null,null,null,-13.75]
[null,"R12",null,null,null,null,{"$f":"Data!W13","v":96.12},null,null,null,null,null,null,null,null,null,{"$f":"Data!K13","v":64.47},null,null,null,null,null,null,null,null,null,null,null,null,-31.650000000000006,null,null,null,null,null,null,"TM30 Rf",null,null,null,null,null,null,null,null,null,null,null,null,null,null,null,null,null,null,null,null,null,null,null,null,null,null,null,null,null,{"$f":"Data!W43","v":97.7},null,null,null,null,null,null,null,null,null,null,null,{"$f":"Data!K43","v":86.1},null,null,null,null,null,null,null,null,null,null,null,null,{"$f":"CA38-BO38","v":-11.600000000000009}]
[null,"R13",null,null,null,null,{"$f":"Data!W14","v":97.25},null,null,null,null,null,null,null,null,null,{"$f":"Data!K14","v":84.59},null,null,null,null,null,null,null,null,null,null,null,null,-12.659999999999997,null,null,null,null,null,null,"TM30 Rg",null,null,null,null,null,null,null,null,null,null,null,null,null,null,null,null,null,null,null,null,null,null,null,null,null,null,null,null,null,{"$f":"Data!W44","v":98.2},null,null,null,null,null,null,null,null,null,null,null,{"$f":"Data!K44","v":95.2},null,null,null,null,null,null,null,null,null,null,null,null,{"$f":"CA39-BO39","v":-3}]
[null,"R14",null,null,null,null,{"$f":"Data!W15","v":99.22},null,null,null,null,null,null,null,null,null,{"$f":"Data!K15","v":97.9},null,null,null,null,null,null,null,null,null,null,null,null,-1.3199999999999932]
[null,"R15",null,null,null,null,{"$f":"Data!W16","v":95.84},null,null,null,null,null,null,null,null,null,{"$f":"Data!K16","v":76.53},null,null,null,null,null,null,null,null,null,null,null,null,-19.310000000000002,null,null,null,null,null,null,"PPFD [µmol/m²s]",null,null,null,null,null,null,null,null,null,null,null,null,null,null,null,null,null,null,null,null,null,null,null,null,null,null,null,null,null,{"$f":"Data!W158","v":42.63},null,null,null,null,null,null,null,null,null,null,null,{"$f":"Data!K158","v":45.52},null,null,null,null,null,null,null,null,null,null,null,null,{"$f":"CA41-BO41","v":2.8900000000000006}]
[null,null,null,null,null,null,null,null,null,null,null,null,null,null,null,null,null,null,null,null,null,null,null,null,null,null,null,null,null,null,null,null,null,null,null,null,"PPFD UV [µmol/m²s]",null,null,null,null,null,null,null,null,null,null,null,null,null,null,null,null,null,null,null,null,null,null,null,null,null,null,null,null,null,{"$f":"Data!W159","v":0.46},null,null,null,null,null,null,null,null,null,null,null,{"$f":"Data!K159","v":7.0000000000000007E-2},null,null,null,null,null,null,null,null,null,null,null,null,-0.39]
[null,"Re",null,null,null,null,{"$f":"Data!AC27","v":96.84},null,null,null,null,null,null,null,null,null,{"$f":"Data!Q27","v":78.510000000000005},null,null,null,null,null,null,null,null,null,null,null,null,{"$f":"Q43-G43","v":-18.329999999999998},null,null,null,null,null,null,{"$f":"IF(Data!$AE$2 = \"DE\", \"PPFD Blau\",IF(Data!$AE$2 = \"UK\",\"PPFD Blue\",IF(Data!$AE$2=\"FR\",\"PPFD Bleu\",\"Language Error\"))) & \" [µmol/m²s]\"","v":"PPFD Blue [µmol/m²s]"},null,null,null,null,null,null,null,null,null,null,null,null,null,null,null,null,null,null,null,null,null,null,null,null,null,null,null,null,null,{"$f":"Data!W161","v":9.9},null,null,null,null,null,null,null,null,null,null,null,{"$f":"Data!K161","v":7.94},null,null,null,null,null,null,null,null,null,null,null,null,-1.96]
[null,"GAI",null,null,null,null,{"$f":"Data!AC28","v":84.82},null,null,null,null,null,null,null,null,null,{"$f":"Data!Q28","v":70.459999999999994},null,null,null,null,null,null,null,null,null,null,null,null,{"$f":"Q44-G44","v":-14.36},null,null,null,null,null,null,{"$f":"IF(Data!$AE$2 = \"DE\", \"PPFD Grün\",IF(Data!$AE$2 = \"UK\",\"PPFD Green\",IF(Data!$AE$2=\"FR\",\"PPFD Vert\",\"Language Error\"))) & \" [µmol/m²s]\"","v":"PPFD Green [µmol/m²s]"},null,null,null,null,null,null,null,null,null,null,null,null,null,null,null,null,null,null,null,null,null,null,null,null,null,null,null,null,null,{"$f":"Data!W163","v":15.67},null,null,null,null,null,null,null,null,null,null,null,{"$f":"Data!K163","v":20.51},null,null,null,null,null,null,null,null,null,null,null,null,4.8400000000000016]
[null,null,null,null,null,null,null,null,null,null,null,null,null,null,null,null,null,null,null,null,null,null,null,null,null,null,null,null,null,null,null,null,null,null,null,null,{"$f":"IF(Data!$AE$2 = \"DE\", \"PPFD Rot\",IF(Data!$AE$2 = \"UK\",\"PPFD Red\",IF(Data!$AE$2=\"FR\",\"PPFD Rouge\",\"Language Error\"))) & \" [µmol/m²s]\"","v":"PPFD Red [µmol/m²s]"},null,null,null,null,null,null,null,null,null,null,null,null,null,null,null,null,null,null,null,null,null,null,null,null,null,null,null,null,null,{"$f":"Data!W165","v":17.059999999999999},null,null,null,null,null,null,null,null,null,null,null,{"$f":"Data!K165","v":17.07},null,null,null,null,null,null,null,null,null,null,null,null,1.0000000000001563E-2]
[null,"TLCI",null,null,null,null,{"$f":"Data!AC30","v":100},null,null,null,null,null,null,null,null,null,{"$f":"Data!Q30","v":75},null,null,null,null,null,null,null,null,null,null,null,null,{"$f":"Q46-G46","v":-25},null,null,null,null,null,null,"PPFD FR [µmol/m²s]",null,null,null,null,null,null,null,null,null,null,null,null,null,null,null,null,null,null,null,null,null,null,null,null,null,null,null,null,null,{"$f":"Data!W166","v":14.76},null,null,null,null,null,null,null,null,null,null,null,{"$f":"Data!K166","v":5.15},null,null,null,null,null,null,null,null,null,null,null,null,-9.61]
[]
[]
[]
[]
[{"$f":"'Protocol 1 (5nm)'!A54:AA54","v":"Company"}]
[{"$f":"'Protocol 1 (5nm)'!A55:AA55","v":"Address"}]
[{"$f":"'Protocol 1 (5nm)'!A56:AA56","v":"ZIP  City"}]
[]
[{"$f":"'Protocol 1 (5nm)'!A58:O58","v":"Test location,"},null,null,null,null,null,null,null,null,null,null,null,null,null,null,{"$f":"'Protocol 1 (5nm)'!P58:AA58","v":"Date"},null,null,null,null,null,null,null,null,null,null,null,null,null,null,null,null,null,null,null,null,null,null,null,null,null,null,null,null,null,null,null,null,null,null,null,null,null,null,null,null,null,null,null,null,null,null,null,{"$f":"'Protocol 1 (5nm)'!BL58:CF58","v":"First, last name of inspector"},null,null,null,null,null,null,null,null,null,null,null,null,null,null,null,null,null,null,null,null,{"$f":"'Protocol 1 (5nm)'!CG58:CX58","v":"Phone number"}]

{"sheet":"Data","index":8,"n_rows":816,"n_cols":43,"rows_kept":816,"cut":false,"hidden":false,"merged":[]}
["Seriennummer","21C10666","Seriennummer","21C10666",null,1,{"$f":"IF(INDEX($A$1:$A$500,MATCH(\"Spe*\",$A$1:$A$500,0)+F1)=0,\"\",INDEX($A$1:$A$500,MATCH(\"Spe*\",$A$1:$A$500,0)+F1))","v":380},{"$f":"IF(INDEX($A$1:$A$500,MATCH(\"Spe*\",$A$1:$A$500,0)+F1)=0,\"\",INDEX($B$1:$B$500,MATCH(\"Spe*\",$A$1:$A$500,0)+F1))","v":0.68384},"CRI","Ra",{"$f":"IF(ISNA(MATCH(I1,$A$1:$A$300,0)),IF($A$1=\"\",NA(),INDEX($B$1:$B$300,MATCH(J1,$A$1:$A$300,0))),IF($A$1=\"\",NA(),INDEX($B$1:$B$300,MATCH(I1,$A$1:$A$300,0))))","v":84.72},{"$f":"IF(K1=\"\",NA(),IF(K1 < 0, 0, K1))","v":84.72},{"$f":"IF(G1=\"\",NA(),ROUND(G1,0))","v":380},{"$f":"IF(H1=\"\",NA(),H1)","v":0.68384},null,"R15",{"$f":"IF($A$1=\"\",NA(),INDEX($B$1:$B$300,MATCH(P1,$A$1:$A$300,0)))","v":76.53},1,{"$f":"IF(INDEX($C$1:$C$500,MATCH(\"Spe*\",$C$1:$C$500,0)+R1)=0,\"\",INDEX($C$1:$C$500,MATCH(\"Spe*\",$C$1:$C$500,0)+R1))","v":380},{"$f":"IF(INDEX($C$1:$C$500,MATCH(\"Spe*\",$C$1:$C$500,0)+R1)=0,\"\",INDEX($D$1:$D$500,MATCH(\"Spe*\",$C$1:$C$500,0)+R1))","v":4.8683699999999996},"CRI","Ra",{"$f":"IF(ISNA(MATCH(U1,$C$1:$C$300,0)),IF($C$1=\"\",NA(),INDEX($D$1:$D$300,MATCH(V1,$C$1:$C$300,0))),IF($C$1=\"\",NA(),INDEX($D$1:$D$300,MATCH(U1,$C$1:$C$300,0))))","v":97.6},null,{"$f":"IF(S1=\"\",NA(),ROUND(S1,0))","v":380},{"$f":"IF(T1=\"\",NA(),T1)","v":4.8683699999999996},null,"R15",{"$f":"IF($C$1=\"\",NA(),INDEX($D$1:$D$300,MATCH(AB1,$C$1:$C$300,0)))","v":95.84},null,null,null,"u","v","u'","v'","x","y",null,"Seriennummer",null,{"$f":"IF(G1=\"\",NA(),G1)","v":380},{"$f":"IF(AP1=\"\",NA(),H1*AP1*0.00836/1000)","v":2.1724229119999996E-3}]
["Software Rev.","1.3.5e B","Software Rev.","1.3.5e B",null,{"$f":"F1+1","v":2},{"$f":"IF(INDEX($A$1:$A$500,MATCH(\"Spe*\",$A$1:$A$500,0)+F2)=0,\"\",INDEX($A$1:$A$500,MATCH(\"Spe*\",$A$1:$A$500,0)+F2))","v":385},{"$f":"IF(INDEX($A$1:$A$500,MATCH(\"Spe*\",$A$1:$A$500,0)+F2)=0,\"\",INDEX($B$1:$B$500,MATCH(\"Spe*\",$A$1:$A$500,0)+F2))","v":0.74607000000000001},null,"R1",{"$f":"IF($A$1=\"\",NA(),INDEX($B$1:$B$300,MATCH(J2,$A$1:$A$300,0)))","v":82.78},{"$f":"IF(K2=\"\",NA(),IF(K2 < 0, 0, K2))","v":82.78},385,{"$f":"IF(H2=\"\",NA(),H2)","v":0.74607000000000001},null,"R14",97.9,{"$f":"R1+1","v":2},{"$f":"IF(INDEX($C$1:$C$500,MATCH(\"Spe*\",$C$1:$C$500,0)+R2)=0,\"\",INDEX($C$1:$C$500,MATCH(\"Spe*\",$C$1:$C$500,0)+R2))","v":385},{"$f":"IF(INDEX($C$1:$C$500,MATCH(\"Spe*\",$C$1:$C$500,0)+R2)=0,\"\",INDEX($D$1:$D$500,MATCH(\"Spe*\",$C$1:$C$500,0)+R2))","v":5.4699600000000004},null,"R1",{"$f":"IF($C$1=\"\",NA(),INDEX($D$1:$D$300,MATCH(V2,$C$1:$C$300,0)))","v":97.11},null,385,{"$f":"IF(T2=\"\",NA(),T2)","v":5.4699600000000004},null,"R14",99.22,null,"UK",null,0.18006,0.26351999999999998,{"$f":"AG2","v":0.18006},{"$f":"AH2*1.5","v":0.39527999999999996},{"$f":"(9*AG2)/(6*AG2-16*AJ2+12)","v":0.23987104566688575},{"$f":"(4*AJ2)/(6*AG2-16*AJ2+12)","v":0.23403612852803776},null,"Software Rev.",null,{"$f":"IF(G2=\"\",NA(),G2)","v":385},{"$f":"IF(AP2=\"\",NA(),H2*AP2*0.00836/1000)","v":2.4013009019999997E-3}]
["Zeit","08:07:17","Zeit","08:18:37",null,{"$f":"F2+1","v":3},390,0.91386999999999996,null,"R2",90.11,90.11,390,0.91386999999999996,null,"R13",84.59,{"$f":"R2+1","v":3},390,6.4230700000000001,null,"R2",98.31,null,390,6.4230700000000001,null,"R13",97.25,null,null,null,0.18065999999999999,0.26589000000000002,{"$f":"AG3","v":0.18065999999999999},{"$f":"AH3*1.5","v":0.39883500000000005},{"$f":"(9*AG3)/(6*AG3-16*AJ3+12)","v":0.24258347506937611},{"$f":"(4*AJ3)/(6*AG3-16*AJ3+12)","v":0.23801808253513571},null,"Zeit",null,390,2.9795817479999999E-3]
["Datum","29.04.2024","Datum","29.04.2024",null,4,395,1.2555099999999999,null,"R3",95.97,95.97,395,1.2555099999999999,null,"R12",64.47,4,395,7.85189,null,"R3",98.94,null,395,7.85189,null,"R12",96.12,null,null,null,0.18132999999999999,0.26845999999999998,0.18132999999999999,0.40268999999999999,0.24559589702841558,0.24240399461846157,null,"Datum",null,395,4.1459451219999994E-3]
[null,null,null,null,null,5,{"$f":"IF(G4=\"\",\"\",IF(INDEX($A$1:$A$500,MATCH(\"Spe*\",$A$1:$A$500,0)+F5)=0,\"\",INDEX($A$1:$A$500,MATCH(\"Spe*\",$A$1:$A$500,0)+F5)))","v":400},{"$f":"IF(H4=\"\",\"\",IF(INDEX($A$1:$A$500,MATCH(\"Spe*\",$A$1:$A$500,0)+F5)=0,\"\",INDEX($B$1:$B$500,MATCH(\"Spe*\",$A$1:$A$500,0)+F5)))","v":1.8004599999999999},null,"R4",83.5,83.5,400,1.8004599999999999,null,"R11",82.47,5,{"$f":"IF(S4=\"\",\"\",IF(INDEX($C$1:$C$500,MATCH(\"Spe*\",$C$1:$C$500,0)+R5)=0,\"\",INDEX($C$1:$C$500,MATCH(\"Spe*\",$C$1:$C$500,0)+R5)))","v":400},{"$f":"IF(T4=\"\",\"\",IF(INDEX($C$1:$C$500,MATCH(\"Spe*\",$C$1:$C$500,0)+R5)=0,\"\",INDEX($D$1:$D$500,MATCH(\"Spe*\",$C$1:$C$500,0)+R5)))","v":11.00745},null,"R4",96.5,null,400,11.00745,null,"R11",96.22,null,null,null,0.18207999999999999,0.27118999999999999,0.18207999999999999,0.40678499999999995,0.24889731345459842,0.24713848284912326,null,null,null,400,6.0207382399999993E-3]
["Integrationszeit [ms]",406,"Integrationszeit [ms]",655,null,6,{"$f":"IF(G5=\"\",\"\",IF(INDEX($A$1:$A$500,MATCH(\"Spe*\",$A$1:$A$500,0)+F6)=0,\"\",INDEX($A$1:$A$500,MATCH(\"Spe*\",$A$1:$A$500,0)+F6)))","v":405},{"$f":"IF(H5=\"\",\"\",IF(INDEX($A$1:$A$500,MATCH(\"Spe*\",$A$1:$A$500,0)+F6)=0,\"\",INDEX($B$1:$B$500,MATCH(\"Spe*\",$A$1:$A$500,0)+F6)))","v":2.1574399999999998},null,"R5",82.71,82.71,405,2.1574399999999998,null,"R10",76.650000000000006,6,{"$f":"IF(S5=\"\",\"\",IF(INDEX($C$1:$C$500,MATCH(\"Spe*\",$C$1:$C$500,0)+R6)=0,\"\",INDEX($C$1:$C$500,MATCH(\"Spe*\",$C$1:$C$500,0)+R6)))","v":405},{"$f":"IF(T5=\"\",\"\",IF(INDEX($C$1:$C$500,MATCH(\"Spe*\",$C$1:$C$500,0)+R6)=0,\"\",INDEX($D$1:$D$500,MATCH(\"Spe*\",$C$1:$C$500,0)+R6)))","v":14.09629},null,"R5",97.12,null,405,14.09629,null,"R10",97.04,null,null,null,0.18293000000000001,0.27406999999999998,0.18293000000000001,0.41110499999999994,0.25251460911977175,0.25221552477798731,null,"Integrationszeit [ms]",null,405,7.3046603519999979E-3]
["E vis [lx]",3202.16,"E vis [lx]",2469.94,null,7,410,2.7395700000000001,null,"R6",86.5,86.5,410,2.7395700000000001,null,"R9",17.21,7,410,15.79012,null,"R6",98.12,null,410,15.79012,null,"R9",90.19,null,null,null,0.18387999999999999,0.27709,0.18387999999999999,0.41563499999999998,0.25645269265099674,0.25763351681047303,null,"E vis [lx]",null,410,9.3901501319999994E-3]
["Ee [W/m²]",10.564,"Ee [W/m²]",11.76,null,8,415,3.6223900000000002,null,"R7",88.13,88.13,415,3.6223900000000002,null,"R8",68.09,8,415,17.87473,null,"R7",98.39,null,415,17.87473,null,"R8",96.29,null,null,null,0.18493999999999999,0.28021000000000001,0.18493999999999999,0.42031499999999999,0.26069918240766848,0.26333051404943147,null,"Ee [W/m²]",null,415,1.2567519866E-2]
["LER [lm/W]",303.10000000000002,"LER [lm/W]",210,null,9,420,4.6374399999999998,null,"R8",68.09,68.09,420,4.6374399999999998,null,"R7",88.13,9,420,18.96669,null,"R8",96.29,null,420,18.96669,null,"R7",98.39,null,null,null,0.18611,0.28342000000000001,0.18611,0.42513000000000001,0.26525754682021607,0.2693005710593579,null,"LER [lm/W]",null,420,1.6282979327999998E-2]
["CCT [K]",4014,"CCT [K]",5126,null,10,425,6.1680599999999997,null,"R9",17.21,17.21,425,6.1680599999999997,null,"R6",86.5,10,425,19.204049999999999,null,"R9",90.19,null,425,19.204049999999999,null,"R6",98.12,null,null,null,0.18740000000000001,0.28667999999999999,0.18740000000000001,0.43001999999999996,0.27011184994426723,0.27547372871583958,null,"CCT [K]",null,425,2.1915117179999995E-2]
["Duv",3.0000000000000001E-3,"Duv",7.0000000000000001E-3,null,11,430,8.7164999999999999,null,"R10",76.650000000000006,76.650000000000006,430,8.7164999999999999,null,"R5",82.71,11,430,19.38673,null,"R10",97.04,null,430,19.38673,null,"R5",97.12,null,null,null,0.1888,0.28997000000000001,0.1888,0.43495499999999998,0.27524005753605724,0.28181977218831394,null,"Duv",null,430,3.1334074199999999E-2]
["TM30 Rf",86.1,"TM30 Rf",97.7,null,12,435,13.82133,null,"R11",82.47,82.47,435,13.82133,null,"R4",83.5,12,435,21.327269999999999,null,"R11",96.22,null,435,21.327269999999999,null,"R4",96.5,null,null,null,0.19031999999999999,0.29326000000000002,0.19031999999999999,0.43989,0.28063070147845237,0.28827854671280279,null,"TM30 Rf",null,435,5.0262648677999996E-2]
["TM30 Rg",95.2,"TM30 Rg",98.2,null,13,440,23.31664,null,"R12",64.47,64.47,440,23.31664,null,"R3",95.97,13,440,23.840699999999998,null,"R12",96.12,null,440,23.840699999999998,null,"R3",98.94,null,null,null,0.19461999999999999,0.30141000000000001,0.19461999999999999,0.45211500000000004,0.29518291573135957,0.3047685494145484,null,"TM30 Rg",null,440,8.5767928575999991E-2]
["R-Bin01 a",0.97364600000000001,"R-Bin01 a",0.97513499999999997,null,14,445,38.419719999999998,null,"R13",84.59,84.59,445,38.419719999999998,null,"R2",90.11,14,445,26.222650000000002,null,"R13",97.25,null,445,26.222650000000002,null,"R2",98.31,null,null,null,0.19961999999999999,0.30920999999999998,0.19961999999999999,0.46381499999999998,0.3110056295311493,0.32116371341324079,null,"R-Bin01 a",null,445,0.14292904234399997]
["R-Bin01 b",0.22806299999999999,"R-Bin01 b",0.22161400000000001,null,15,450,50.485010000000003,null,"R14",97.9,97.9,450,50.485010000000003,null,"R1",82.78,15,450,28.430029999999999,null,"R14",99.22,null,450,28.430029999999999,null,"R1",97.11,null,null,null,0.20524999999999999,0.31646999999999997,0.20524999999999999,0.47470499999999993,0.32774625546909086,0.33689600476915366,null,"R-Bin01 b",null,450,0.18992460762000002]
["R-Bin02 a",0.81950699999999999,"R-Bin02 a",0.82903700000000002,null,16,455,48.125909999999998,null,"R15",76.53,76.53,455,48.125909999999998,"CRI","Ra",{"$f":"IF(ISNA(MATCH(O16,$A$1:$A$300,0)),IF($A$1=\"\",NA(),INDEX($B$1:$B$300,MATCH(P16,$A$1:$A$300,0))),IF($A$1=\"\",NA(),INDEX($B$1:$B$300,MATCH(O16,$A$1:$A$300,0))))","v":84.72},16,455,29.985900000000001,null,"R15",95.84,null,455,29.985900000000001,"CRI","Ra",{"$f":"IF(ISNA(MATCH(AA16,$C$1:$C$300,0)),IF($C$1=\"\",NA(),INDEX($D$1:$D$300,MATCH(AB16,$C$1:$C$300,0))),IF($C$1=\"\",NA(),INDEX($D$1:$D$300,MATCH(AA16,$C$1:$C$300,0))))","v":97.6},null,null,null,0.21142,0.32312000000000002,0.21142,0.48468,0.34510414172851323,0.35162252160097501,null,"R-Bin02 a",null,455,0.18306133645799996]
["R-Bin02 b",0.57306900000000005,"R-Bin02 b",0.55919399999999997,null,17,460,37.257539999999999,null,"Integrationtime [ms]",null,null,460,37.257539999999999,null,null,null,17,460,30.982320000000001,null,"Integrationtime [ms]",null,null,460,30.982320000000001,null,null,null,null,null,null,0.21807000000000001,0.32908999999999999,0.21807000000000001,0.49363499999999999,0.36276075456632401,0.36496212751328033,null,"R-Bin02 b",null,460,0.14327759582399999]
["R-Bin03 a",0.54763700000000004,"R-Bin03 a",0.54855299999999996,null,18,465,29.61403,null,"Integrationszeit [ms]",{"$f":"IF(ISNA(MATCH(J17,$A$1:$A$300,0)),IF($A$1=\"\",NA(),INDEX($B$1:$B$300,MATCH(J18,$A$1:$A$300,0))),IF($A$1=\"\",NA(),INDEX($B$1:$B$300,MATCH(J17,$A$1:$A$300,0))))","v":406},null,465,29.61403,null,"measurement","M_000003.CSV",18,465,31.529330000000002,null,"Integrationszeit [ms]",{"$f":"IF(ISNA(MATCH(V17,$C$1:$C$300,0)),IF($C$1=\"\",NA(),INDEX($D$1:$D$300,MATCH(V18,$C$1:$C$300,0))),IF($C$1=\"\",NA(),INDEX($D$1:$D$300,MATCH(V17,$C$1:$C$300,0))))","v":655},null,465,31.529330000000002,null,"reference","M_000004.CSV",null,null,null,0.22511,0.33439000000000002,0.22511,0.50158500000000006,0.38044617204664538,0.37675623908512212,null,"R-Bin03 a",null,465,0.11512158022199999]
["R-Bin03 b",0.83671600000000002,"R-Bin03 b",0.83611599999999997,null,19,470,24.335519999999999,null,null,null,null,470,24.335519999999999,null,null,null,19,470,31.893429999999999,null,null,null,null,470,31.893429999999999,null,null,null,null,null,null,0.23247000000000001,0.33904000000000001,0.23247000000000001,0.50856000000000001,0.39792425055060426,0.38689504855587636,null,"R-Bin03 b",null,470,9.5619125183999995E-2]
["R-Bin04 a",0.16631599999999999,"R-Bin04 a",0.18104700000000001,null,20,475,20.106950000000001,null,"Lambda Peak [nm]",{"$f":"IF($A$1=\"\",NA(),INDEX($B$1:$B$300,MATCH(J20,$A$1:$A$300,0)))","v":595},null,475,20.106950000000001,null,"Time",null,20,475,32.688589999999998,null,"Lambda Peak [nm]",{"$f":"IF($C$1=\"\",NA(),INDEX($D$1:$D$300,MATCH(V20,$C$1:$C$300,0)))","v":535},null,475,32.688589999999998,null,"Time",null,null,null,null,0.24010000000000001,0.34308,0.24010000000000001,0.51461999999999997,0.41502454539168915,0.39535366106616876,null,"R-Bin04 a",null,475,7.9844698450000001E-2]
["R-Bin04 b",0.98607299999999998,"R-Bin04 b",0.98347399999999996,null,21,480,18.811810000000001,null,"Lambda Peak",{"$f":"IF($A$1=\"\",NA(),INDEX($B$1:$B$300,MATCH(J21,$A$1:$A$300,0)))","v":53.945639999999997},null,480,18.811810000000001,null,"Zeit",{"$f":"IF(ISNA(MATCH(P20,$A$1:$A$300,0)),IF($A$1=\"\",NA(),INDEX($B$1:$B$300,MATCH(P21,$A$1:$A$300,0))),IF($A$1=\"\",NA(),INDEX($B$1:$B$300,MATCH(P20,$A$1:$A$300,0))))","v":"08:07:17"},21,480,33.247459999999997,null,"Lambda Peak",{"$f":"IF($C$1=\"\",NA(),INDEX($D$1:$D$300,MATCH(V21,$C$1:$C$300,0)))","v":35.701599999999999},null,480,33.247459999999997,null,"Zeit",{"$f":"IF(ISNA(MATCH(AB20,$C$1:$C$300,0)),IF($C$1=\"\",NA(),INDEX($D$1:$D$300,MATCH(AB21,$C$1:$C$300,0))),IF($C$1=\"\",NA(),INDEX($D$1:$D$300,MATCH(AB20,$C$1:$C$300,0))))","v":"08:18:37"},null,null,null,0.24701999999999999,0.34655000000000002,0.24701999999999999,0.51982499999999998,0.43043841918171039,0.40258125972909548,null,"R-Bin04 b",null,480,7.5488031168E-2]
["R-Bin05 a",-0.116158,"R-Bin05 a",-0.107809,null,22,485,19.296890000000001,null,null,null,null,485,19.296890000000001,null,"Date",null,22,485,32.787480000000002,null,null,null,null,485,32.787480000000002,null,"Date",null,null,null,null,0.25591000000000003,0.34950999999999999,0.25591000000000003,0.52426499999999998,0.44746290230454494,0.40741604205765436,null,"R-Bin05 a",null,485,7.8241170193999995E-2]
["R-Bin05 b",0.99323099999999998,"R-Bin05 b",0.99417199999999994,null,23,490,21.250699999999998,null,"x",{"$f":"IF($A$1=\"\",NA(),INDEX($B$1:$B$300,MATCH(J23,$A$1:$A$300,0)))","v":0.38190000000000002},null,490,21.250699999999998,null,"Datum",{"$f":"IF(ISNA(MATCH(P22,$A$1:$A$300,0)),IF($A$1=\"\",NA(),INDEX($B$1:$B$300,MATCH(P23,$A$1:$A$300,0))),IF($A$1=\"\",NA(),INDEX($B$1:$B$300,MATCH(P22,$A$1:$A$300,0))))","v":"29.04.2024"},23,490,32.907299999999999,null,"x",{"$f":"IF($C$1=\"\",NA(),INDEX($D$1:$D$300,MATCH(V23,$C$1:$C$300,0)))","v":0.34260000000000002},null,490,32.907299999999999,null,"Datum",{"$f":"IF(ISNA(MATCH(AB22,$C$1:$C$300,0)),IF($C$1=\"\",NA(),INDEX($D$1:$D$300,MATCH(AB23,$C$1:$C$300,0))),IF($C$1=\"\",NA(),INDEX($D$1:$D$300,MATCH(AB22,$C$1:$C$300,0))))","v":"29.04.2024"},null,null,null,0.26400000000000001,0.35199999999999998,0.26400000000000001,0.52800000000000002,0.46261682242990665,0.41121495327102814,null,"R-Bin05 b",null,490,8.7051367479999989E-2]
["R-Bin06 a",-0.54651899999999998,"R-Bin06 a",-0.52401500000000001,null,24,495,24.390899999999998,null,"y",0.38419999999999999,null,495,24.390899999999998,null,"Ee [W/m2]",null,24,495,33.778849999999998,null,"y",0.36370000000000002,null,495,33.778849999999998,null,"Ee [W/m≤]",null,null,null,null,0.27217999999999998,0.35407,0.27217999999999998,0.53110499999999994,0.47700665965650185,0.4136815048486972,null,"R-Bin06 a",null,495,0.10093442237999999]
["R-Bin06 b",0.83744600000000002,"R-Bin06 b",0.85170900000000005,null,25,500,27.90953,null,"u'",0.22309999999999999,null,500,27.90953,null,"Ee [W/m²]",{"$f":"IF(ISNA(MATCH(P24,$A$1:$A$300,0)),IF($A$1=\"\",NA(),INDEX($B$1:$B$300,MATCH(P25,$A$1:$A$300,0))),IF($A$1=\"\",NA(),INDEX($B$1:$B$300,MATCH(P24,$A$1:$A$300,0))))","v":10.564},25,500,33.766120000000001,null,"u'",0.20519999999999999,null,500,33.766120000000001,null,"Ee [W/m²]",{"$f":"IF(ISNA(MATCH(AB24,$C$1:$C$300,0)),IF($C$1=\"\",NA(),INDEX($D$1:$D$300,MATCH(AB25,$C$1:$C$300,0))),IF($C$1=\"\",NA(),INDEX($D$1:$D$300,MATCH(AB24,$C$1:$C$300,0))))","v":11.76},null,null,null,0.28038999999999997,0.35576999999999998,0.28038999999999997,0.53365499999999999,0.49058683556706439,0.41498407810476956,null,"R-Bin06 b",null,500,0.11666183539999998]
["R-Bin07 a",-0.85275999999999996,"R-Bin07 a",-0.83186800000000005,null,26,505,31.271339999999999,null,"v'",0.505,null,505,31.271339999999999,null,"LER [lm/W]",{"$f":"IF($A$1=\"\",NA(),INDEX($B$1:$B$300,MATCH(P26,$A$1:$A$300,0)))","v":303.10000000000002},26,505,33.901580000000003,null,"v'",0.49009999999999998,null,505,33.901580000000003,null,"LER [lm/W]",{"$f":"IF($C$1=\"\",NA(),INDEX($D$1:$D$300,MATCH(AB26,$C$1:$C$300,0)))","v":210},null,null,null,0.28863,0.35714000000000001,0.28863,0.53571000000000002,0.503383445533503,0.41524527073377748,null,"R-Bin07 a",null,505,0.13202134321199999]
["R-Bin07 b",0.52230200000000004,"R-Bin07 b",0.55497300000000005,null,27,510,33.841369999999998,null,"u",0.22309999999999999,null,510,33.841369999999998,null,"Re",{"$f":"IF($A$1=\"\",NA(),INDEX($B$1:$B$300,MATCH(P27,$A$1:$A$300,0)))","v":78.510000000000005},27,510,34.187289999999997,null,"u",0.20519999999999999,null,510,34.187289999999997,null,"Re",{"$f":"IF($C$1=\"\",NA(),INDEX($D$1:$D$300,MATCH(AB27,$C$1:$C$300,0)))","v":96.84},null,null,null,0.29685,0.35822999999999999,0.29685,0.53734499999999996,0.51540634079149927,0.41465165001794119,null,"R-Bin07 b",null,510,0.14428606513199999]
["R-Bin08 a",-0.98851500000000003,"R-Bin08 a",-0.98975800000000003,null,28,515,35.920009999999998,null,"v",0.3367,null,515,35.920009999999998,null,"GAI",{"$f":"IF(ISNA(MATCH(O28,$A$1:$A$300,0)),IF($A$1=\"\",NA(),INDEX($B$1:$B$300,MATCH(P28,$A$1:$A$300,0))),IF($A$1=\"\",NA(),INDEX($B$1:$B$300,MATCH(O28,$A$1:$A$300,0))))","v":70.459999999999994},28,515,33.825180000000003,null,"v",0.32669999999999999,null,515,33.825180000000003,null,"GAI",{"$f":"IF(ISNA(MATCH(AA28,$C$1:$C$300,0)),IF($C$1=\"\",NA(),INDEX($D$1:$D$300,MATCH(AB28,$C$1:$C$300,0))),IF($C$1=\"\",NA(),INDEX($D$1:$D$300,MATCH(AA28,$C$1:$C$300,0))))","v":84.82},null,null,null,0.30504999999999999,0.35907,0.30504999999999999,0.538605,0.52669291066680479,0.41330847059636044,null,"R-Bin08 a",null,515,0.154650011054]
["R-Bin08 b",0.15112,"R-Bin08 b",0.14275299999999999,null,29,520,37.57893,null,null,null,null,520,37.57893,null,null,null,29,520,33.896500000000003,null,null,null,null,520,33.896500000000003,null,null,null,null,null,null,0.31319999999999998,0.35968,0.31319999999999998,0.53952,0.53723355594181688,0.41130729119019305,null,"R-Bin08 b",null,520,0.16336312449599999]
["R-Bin09 a",-0.99354500000000001,"R-Bin09 a",-0.98970899999999995,null,30,525,38.95928,null,"CCT [K]",{"$f":"IF($A$1=\"\",NA(),INDEX($B$1:$B$300,MATCH(J30,$A$1:$A$300,0)))","v":4014},null,525,38.95928,null,"TLCI",{"$f":"IF($A$1=\"\",NA(),INDEX($B$1:$B$300,MATCH(P30,$A$1:$A$300,0)))","v":75},30,525,34.675460000000001,null,"CCT [K]",{"$f":"IF($C$1=\"\",NA(),INDEX($D$1:$D$300,MATCH(V30,$C$1:$C$300,0)))","v":5126},null,525,34.675460000000001,null,"TLCI",{"$f":"IF($C$1=\"\",NA(),INDEX($D$1:$D$300,MATCH(AB30,$C$1:$C$300,0)))","v":100},null,null,null,0.32129000000000002,0.36010999999999999,0.32129000000000002,0.54016500000000001,0.54712493614122726,0.40882102514616564,null,"R-Bin09 a",null,525,0.17099227991999999]
["R-Bin09 b",-0.113437,"R-Bin09 b",-0.143095,null,31,530,40.104469999999999,null,"Duv",{"$f":"IF($A$1=\"\",NA(),INDEX($B$1:$B$300,MATCH(J31,$A$1:$A$300,0)))","v":3.0000000000000001E-3},null,530,40.104469999999999,null,"Ref.Type",{"$f":"IF(K30<3400,\"Plank\",IF(K30>5000,\"Daylight\",\"Plank-Daylight Mix\"))","v":"Plank-Daylight Mix"},31,530,35.293309999999998,null,"Duv",{"$f":"IF($C$1=\"\",NA(),INDEX($D$1:$D$300,MATCH(V31,$C$1:$C$300,0)))","v":7.0000000000000001E-3},null,530,35.293309999999998,null,"Ref.Type",{"$f":"IF(W30<3400,\"P\",IF(W30>5000,\"D\",\"M\"))","v":"D"},null,null,null,0.32930999999999999,0.36037999999999998,0.32930999999999999,0.54056999999999999,0.55639847261176623,0.4059293301343786,null,"R-Bin09 b",null,530,0.17769488567599998]
["R-Bin10 a",-0.870587,"R-Bin10 a",-0.85787500000000005,null,32,535,41.304229999999997,null,"E vis [fc]",null,null,535,41.304229999999997,{"$f":"IF(Q32=\"\",NA(),IF(Q32 < 0, 0, Q32))","v":80},"Q1",{"$f":"IF($A$1=\"\",NA(),INDEX($B$1:$B$300,MATCH(P32,$A$1:$A$300,0)))","v":80},32,535,35.68224,null,"E vis [fc]",null,null,535,35.68224,null,"Q1",{"$f":"IF($C$1=\"\",NA(),INDEX($D$1:$D$300,MATCH(AB32,$C$1:$C$300,0)))","v":99},null,null,null,0.33723999999999998,0.36051,0.33723999999999998,0.54076499999999994,0.56508042895442345,0.40271447721179615,null,"R-Bin10 a",null,535,0.18473729909799996]
["R-Bin10 b",-0.49201499999999998,"R-Bin10 b",-0.51385899999999995,null,33,540,42.239730000000002,null,"E vis [lx]",{"$f":"IF(ISNA(MATCH(J32,$A$1:$A$300,0)),IF($A$1=\"\",NA(),INDEX($B$1:$B$300,MATCH(J33,$A$1:$A$300,0))),IF($A$1=\"\",NA(),INDEX($B$1:$B$300,MATCH(J32,$A$1:$A$300,0))))","v":3202.16},null,540,42.239730000000002,{"$f":"IF(Q33=\"\",NA(),IF(Q33 < 0, 0, Q33))","v":86},"Q2",86,33,540,35.4527,null,"E vis [lx]",{"$f":"IF(ISNA(MATCH(V32,$C$1:$C$300,0)),IF($C$1=\"\",NA(),INDEX($D$1:$D$300,MATCH(V33,$C$1:$C$300,0))),IF($C$1=\"\",NA(),INDEX($D$1:$D$300,MATCH(V32,$C$1:$C$300,0))))","v":2469.94},null,540,35.4527,null,"Q2",99,null,null,null,0.37,0.35980000000000001,{"$f":"AG33","v":0.37},{"$f":"AH33*1.5","v":0.53970000000000007},{"$f":"(9*AG33)/(6*AG33-16*AJ33+12)","v":0.59626128061882266},{"$f":"(4*AJ33)/(6*AG33-16*AJ33+12)","v":0.38654920498495932},null,"R-Bin10 b",null,540,0.190687037112]
["R-Bin11 a",-0.56674199999999997,"R-Bin11 a",-0.55791500000000005,null,34,545,43.382800000000003,null,null,null,null,545,43.382800000000003,86,"Q3",86,34,545,35.493510000000001,null,null,null,null,545,35.493510000000001,null,"Q3",99,null,null,null,0.4,0.35699999999999998,{"$f":"AG34","v":0.4},{"$f":"AH34*1.5","v":0.53549999999999998},{"$f":"(9*AG34)/(6*AG34-16*AJ34+12)","v":0.61728395061728392},{"$f":"(4*AJ34)/(6*AG34-16*AJ34+12)","v":0.36728395061728386},null,"R-Bin11 a",null,545,0.19766071335999999]
["R-Bin11 b",-0.82389500000000004,"R-Bin11 b",-0.82989800000000002,null,35,550,44.504919999999998,null,"Flicker Index",{"$f":"IF($A$1=\"\",NA(),INDEX($B$1:$B$300,MATCH(J35,$A$1:$A$300,0)))","v":5.0999999999999997E-2},null,550,44.504919999999998,89,"Q4",89,35,550,35.560569999999998,null,"Flicker Index",{"$f":"IF($C$1=\"\",NA(),INDEX($D$1:$D$300,MATCH(V35,$C$1:$C$300,0)))","v":2E-3},null,550,35.560569999999998,null,"Q4",99,null,null,null,null,null,null,null,null,null,null,"R-Bin11 b",null,550,0.20463362215999997]
["R-Bin12 a",-0.30880099999999999,"R-Bin12 a",-0.15246499999999999,null,36,555,45.709710000000001,null,"Flicker [Hz]",{"$f":"IF($A$1=\"\",NA(),INDEX($B$1:$B$300,MATCH(J36,$A$1:$A$300,0)))","v":99.9},null,555,45.709710000000001,99,"Q5",99,36,555,35.349110000000003,null,"Flicker [Hz]",{"$f":"IF($C$1=\"\",NA(),INDEX($D$1:$D$300,MATCH(V36,$C$1:$C$300,0)))","v":0},null,555,35.349110000000003,null,"Q5",99,null,null,null,null,null,null,null,null,null,null,"R-Bin12 a",null,555,0.21208391245799998]
["R-Bin12 b",-0.95112699999999994,"R-Bin12 b",-0.98830899999999999,null,37,560,47.049399999999999,null,"Flicker [%]",{"$f":"IF($A$1=\"\",NA(),INDEX($B$1:$B$300,MATCH(J37,$A$1:$A$300,0)))","v":17.2},null,560,47.049399999999999,76,"Q6",76,37,560,34.814500000000002,null,"Flicker [%]",{"$f":"IF($C$1=\"\",NA(),INDEX($D$1:$D$300,MATCH(V37,$C$1:$C$300,0)))","v":1},null,560,34.814500000000002,null,"Q6",99,null,null,null,null,null,null,null,null,null,null,"R-Bin12 b",null,560,0.22026647103999999]
["R-Bin13 a",0.18357799999999999,"R-Bin13 a",0.16566700000000001,null,38,565,48.187980000000003,null,"Excitation Purity [%]",null,null,565,48.187980000000003,95,"Q7",95,38,565,34.082479999999997,null,"Excitation Purity [%]",null,null,565,34.082479999999997,null,"Q7",99,null,null,null,null,null,null,null,null,null,null,"R-Bin13 a",null,565,0.227611104732]
["R-Bin13 b",-0.98300500000000002,"R-Bin13 b",-0.986182,null,39,570,49.69511,null,"Farbreinheit [%]",{"$f":"IF(ISNA(MATCH(J38,$A$1:$A$300,0)),IF($A$1=\"\",NA(),INDEX($B$1:$B$300,MATCH(J39,$A$1:$A$300,0))),IF($A$1=\"\",NA(),INDEX($B$1:$B$300,MATCH(J38,$A$1:$A$300,0))))","v":29.9},null,570,49.69511,86,"Q8",86,39,570,33.552959999999999,null,"Farbreinheit [%]",{"$f":"IF(ISNA(MATCH(V38,$C$1:$C$300,0)),IF($C$1=\"\",NA(),INDEX($D$1:$D$300,MATCH(V39,$C$1:$C$300,0))),IF($C$1=\"\",NA(),INDEX($D$1:$D$300,MATCH(V38,$C$1:$C$300,0))))","v":12},null,570,33.552959999999999,null,"Q8",99,null,null,null,null,null,null,null,null,null,null,"R-Bin13 b",null,570,0.23680713817199997]
["R-Bin14 a",0.581565,"R-Bin14 a",0.59894499999999995,null,40,575,51.013109999999998,null,"Dominante Wellenlänge [nm]",{"$f":"IF(ISNA(MATCH(J41,$A$1:$A$300,0)),IF($A$1=\"\",NA(),INDEX($B$1:$B$300,MATCH(\"Dominante Wellenl*\",$A$1:$A$300,0))),IF($A$1=\"\",NA(),INDEX($B$1:$B$300,MATCH(J41,$A$1:$A$300,0))))","v":577},null,575,51.013109999999998,96,"Q9",96,40,575,33.209710000000001,null,"Dominante Wellenlänge [nm]",{"$f":"IF(ISNA(MATCH(V41,$C$1:$C$300,0)),IF($C$1=\"\",NA(),INDEX($D$1:$D$300,MATCH(V40,$C$1:$C$300,0))),IF($C$1=\"\",NA(),INDEX($D$1:$D$300,MATCH(V41,$C$1:$C$300,0))))","v":565},null,575,33.209710000000001,null,"Q9",99,null,null,null,null,null,null,null,null,null,null,"R-Bin14 a",null,575,0.24522001976999996]
["R-Bin14 b",-0.8135,"R-Bin14 b",-0.80079,null,41,580,52.255859999999998,null,"Dominant wavelength [nm]",null,null,580,52.255859999999998,85,"Q10",85,41,580,33.343850000000003,null,"Dominant wavelength [nm]",null,null,580,33.343850000000003,null,"Q10",99,null,null,null,null,null,null,null,null,null,null,"R-Bin14 b",null,580,0.25337821396799998]
["R-Bin15 a",0.81660200000000005,"R-Bin15 a",0.83754799999999996,null,42,585,53.208840000000002,null,null,null,null,585,53.208840000000002,58,"Q11",58,42,585,32.963650000000001,null,null,null,null,585,32.963650000000001,null,"Q11",99,null,null,null,null,null,null,null,null,null,null,"R-Bin15 a",null,585,0.260223152904]
["R-Bin15 b",-0.57720199999999999,"R-Bin15 b",-0.54636399999999996,null,43,590,53.498269999999998,null,"TM30 Rf",{"$f":"IF($A$1=\"\",NA(),INDEX($B$1:$B$300,MATCH(J43,$A$1:$A$300,0)))","v":86.1},null,590,53.498269999999998,96,"Q12",96,43,590,31.826820000000001,null,"TM30 Rf",{"$f":"IF($C$1=\"\",NA(),INDEX($D$1:$D$300,MATCH(V43,$C$1:$C$300,0)))","v":97.7},null,590,31.826820000000001,null,"Q12",99,null,null,null,null,null,null,null,null,null,null,"R-Bin15 b",null,590,0.263874866948]
["R-Bin16 a",0.985124,"R-Bin16 a",0.98699499999999996,null,44,595,53.85181,null,"TM30 Rg",95.2,null,595,53.85181,83,"Q13",83,44,595,31.915839999999999,null,"TM30 Rg",98.2,null,595,31.915839999999999,null,"Q13",99,null,null,null,null,null,null,null,null,null,null,"R-Bin16 a",null,595,0.26786967330199996]
["R-Bin16 b",-0.171848,"R-Bin16 b",-0.160751,null,45,600,53.785820000000001,null,"R-Bin01 a",0.97364600000000001,null,600,53.785820000000001,92,"Q14",92,45,600,32.576860000000003,null,"R-Bin01 a",0.97513499999999997,null,600,32.576860000000003,null,"Q14",99,null,null,null,null,null,null,null,null,null,null,"R-Bin16 b",null,600,0.26978967311999996]
["T-Bin01 a",0.87146100000000004,"T-Bin01 a",0.96548599999999996,null,46,605,52.931550000000001,null,"R-Bin01 b",0.22806299999999999,null,605,52.931550000000001,93,"Q15",93,46,605,32.980910000000002,null,"R-Bin01 b",0.22161400000000001,null,605,32.980910000000002,null,"Q15",99,null,null,null,null,null,null,null,null,null,null,"T-Bin01 a",null,605,0.26771719359000001]
["T-Bin01 b",0.203593,"T-Bin01 b",0.21945600000000001,null,47,610,51.470959999999998,null,"R-Bin02 a",0.81950699999999999,null,610,51.470959999999998,50,"Q16",50,47,610,32.890790000000003,null,"R-Bin02 a",0.82903700000000002,null,610,32.890790000000003,null,"Q16",99,null,null,null,null,null,null,null,null,null,null,"T-Bin01 b",null,610,0.26248130761599997]
["T-Bin02 a",0.73860599999999998,"T-Bin02 a",0.82554799999999995,null,48,615,49.462730000000001,null,"R-Bin02 b",0.57306900000000005,null,615,49.462730000000001,93,"Q17",93,48,615,32.654049999999998,null,"R-Bin02 b",0.55919399999999997,null,615,32.654049999999998,null,"Q17",99,null,null,null,null,null,null,null,null,null,null,"T-Bin02 a",null,615,0.25430768002199999]
["T-Bin02 b",0.57584999999999997,"T-Bin02 b",0.55317799999999995,null,49,620,47.248339999999999,null,"R-Bin03 a",0.54763700000000004,null,620,47.248339999999999,51,"Q18",51,49,620,32.435200000000002,null,"R-Bin03 a",0.54855299999999996,null,620,32.435200000000002,null,"Q18",99,null,null,null,null,null,null,null,null,null,null,"T-Bin02 b",null,620,0.24489759588799997]
["T-Bin03 a",0.45469500000000002,"T-Bin03 a",0.55004200000000003,null,50,625,44.708779999999997,null,"R-Bin03 b",0.83671600000000002,null,625,44.708779999999997,null,"R Lightness",3,50,625,31.896429999999999,null,"R-Bin03 b",0.83611599999999997,null,625,31.896429999999999,null,"R Lightness",0,null,null,null,null,null,null,null,null,null,null,"T-Bin03 a",null,625,0.23360337549999996]
["T-Bin03 b",0.85168200000000005,"T-Bin03 b",0.82580200000000004,null,51,630,41.866079999999997,null,"R-Bin04 a",0.16631599999999999,null,630,41.866079999999997,null,"R Chroma",2,51,630,31.518370000000001,null,"R-Bin04 a",0.18104700000000001,null,630,31.518370000000001,null,"R Chroma",0,null,null,null,null,null,null,null,null,null,null,"T-Bin03 b",null,630,0.22050027014399995]
["T-Bin04 a",0.115262,"T-Bin04 a",0.18971399999999999,null,52,635,39.115130000000001,null,"R-Bin04 b",0.98607299999999998,null,635,39.115130000000001,null,"R Hue",0,52,635,31.882719999999999,null,"R-Bin04 b",0.98347399999999996,null,635,31.882719999999999,null,"R Hue",0,null,null,null,null,null,null,null,null,null,null,"T-Bin04 a",null,635,0.20764657911799997]
["T-Bin04 b",0.98522200000000004,"T-Bin04 b",0.97069000000000005,null,53,640,36.297190000000001,null,"R-Bin05 a",-0.116158,null,640,36.297190000000001,null,"R/Y Lightness",0,53,640,31.998830000000002,null,"R-Bin05 a",-0.107809,null,640,31.998830000000002,null,"R/Y Lightness",0,null,null,null,null,null,null,null,null,null,null,"T-Bin04 b",null,640,0.19420448537599999]
["T-Bin05 a",-0.14085500000000001,"T-Bin05 a",-9.6110000000000001E-2,null,54,645,33.354109999999999,null,"R-Bin05 b",0.99323099999999998,null,645,33.354109999999999,null,"R/Y Chroma",1,54,645,31.509540000000001,null,"R-Bin05 b",0.99417199999999994,null,645,31.509540000000001,null,"R/Y Chroma",0,null,null,null,null,null,null,null,null,null,null,"T-Bin05 a",null,645,0.17985203194199997]
["T-Bin05 b",0.97765400000000002,"T-Bin05 b",0.97790500000000002,null,55,650,30.468530000000001,null,"R-Bin06 a",-0.54651899999999998,null,650,30.468530000000001,null,"R/Y Hue",-2,55,650,30.996189999999999,null,"R-Bin06 a",-0.52401500000000001,null,650,30.996189999999999,null,"R/Y Hue",0,null,null,null,null,null,null,null,null,null,null,"T-Bin05 b",null,650,0.16556599201999997]
["T-Bin06 a",-0.53548899999999999,"T-Bin06 a",-0.51084099999999999,null,56,655,27.645689999999998,null,"R-Bin06 b",0.83744600000000002,null,655,27.645689999999998,null,"Y Lightness",0,56,655,30.832129999999999,null,"R-Bin06 b",0.85170900000000005,null,655,30.832129999999999,null,"Y Lightness",0,null,null,null,null,null,null,null,null,null,null,"T-Bin06 a",null,655,0.15138226930199997]
["T-Bin06 b",0.84631400000000001,"T-Bin06 b",0.83886799999999995,null,57,660,25.30733,null,"R-Bin07 a",-0.85275999999999996,null,660,25.30733,null,"Y Chroma",0,57,660,31.51024,null,"R-Bin07 a",-0.83186800000000005,null,660,31.51024,null,"Y Chroma",0,null,null,null,null,null,null,null,null,null,null,"T-Bin06 b",null,660,0.13963572400800001]
["T-Bin07 a",-0.804006,"T-Bin07 a",-0.81944600000000001,null,58,665,23.26774,null,"R-Bin07 b",0.52230200000000004,null,665,23.26774,null,"Y Hue",-2,58,665,32.262999999999998,null,"R-Bin07 b",0.55497300000000005,null,665,32.262999999999998,null,"Y Hue",0,null,null,null,null,null,null,null,null,null,null,"T-Bin07 a",null,665,0.12935467375599999]
["T-Bin07 b",0.51369799999999999,"T-Bin07 b",0.54234300000000002,null,59,670,21.508050000000001,null,"R-Bin08 a",-0.98851500000000003,null,670,21.508050000000001,null,"Y/G Lightness",0,59,670,32.3872,null,"R-Bin08 a",-0.98975800000000003,null,670,32.3872,null,"Y/G Lightness",0,null,null,null,null,null,null,null,null,null,null,"T-Bin07 b",null,670,0.12047088966]
["T-Bin08 a",-0.93110700000000002,"T-Bin08 a",-0.97754600000000003,null,60,675,19.688700000000001,null,"R-Bin08 b",0.15112,null,675,19.688700000000001,null,"Y/G Chroma",0,60,675,32.215690000000002,null,"R-Bin08 b",0.14275299999999999,null,675,32.215690000000002,null,"Y/G Chroma",0,null,null,null,null,null,null,null,null,null,null,"T-Bin08 a",null,675,0.11110333409999999]
["T-Bin08 b",0.13547100000000001,"T-Bin08 b",0.131887,null,61,680,17.91291,null,"R-Bin09 a",-0.99354500000000001,null,680,17.91291,null,"Y/G Hue",0,61,680,31.39199,null,"R-Bin09 a",-0.98970899999999995,null,680,31.39199,null,"Y/G Hue",0,null,null,null,null,null,null,null,null,null,null,"T-Bin08 b",null,680,0.10183131076799999]
["T-Bin09 a",-0.92115000000000002,"T-Bin09 a",-0.97947399999999996,null,62,685,16.05528,null,"R-Bin09 b",-0.113437,null,685,16.05528,null,"G Lightness",0,62,685,29.203489999999999,null,"R-Bin09 b",-0.143095,null,685,29.203489999999999,null,"G Lightness",0,null,null,null,null,null,null,null,null,null,null,"T-Bin09 a",null,685,9.194216644799999E-2]
["T-Bin09 b",-0.165129,"T-Bin09 b",-0.15626699999999999,null,63,690,14.52068,null,"R-Bin10 a",-0.870587,null,690,14.52068,null,"G Chroma",0,63,690,27.984940000000002,null,"R-Bin10 a",-0.85787500000000005,null,690,27.984940000000002,null,"G Chroma",0,null,null,null,null,null,null,null,null,null,null,"T-Bin09 b",null,690,8.3761090511999994E-2]
["T-Bin10 a",-0.76329599999999997,"T-Bin10 a",-0.85141100000000003,null,64,695,13.57545,null,"R-Bin10 b",-0.49201499999999998,null,695,13.57545,null,"G Hue",{"$f":"IF($A$1=\"\",NA(),INDEX($B$1:$B$300,MATCH(P64,$A$1:$A$300,0)))","v":1},64,695,28.82901,null,"R-Bin10 b",-0.51385899999999995,null,695,28.82901,null,"G Hue",{"$f":"IF($C$1=\"\",NA(),INDEX($D$1:$D$300,MATCH(AB64,$C$1:$C$300,0)))","v":0},null,null,null,null,null,null,null,null,null,null,"T-Bin10 a",null,695,7.8876079589999995E-2]
["T-Bin10 b",-0.55508500000000005,"T-Bin10 b",-0.52210699999999999,null,65,700,13.04884,null,"R-Bin11 a",-0.56674199999999997,null,700,13.04884,null,"G/C Lightness",0,65,700,29.97842,null,"R-Bin11 a",-0.55791500000000005,null,700,29.97842,null,"G/C Lightness",0,null,null,null,null,null,null,null,null,null,null,"T-Bin10 b",null,700,7.6361811679999989E-2]
["T-Bin11 a",-0.47816599999999998,"T-Bin11 a",-0.55883099999999997,null,66,705,12.820119999999999,null,"R-Bin11 b",-0.82389500000000004,null,{"$f":"IF(G66=\"\",NA(),ROUND(G66,0))","v":705},{"$f":"IF(H66=\"\",NA(),H66)","v":12.820119999999999},null,"G/C Chroma",0,66,705,30.925750000000001,null,"R-Bin11 b",-0.82989800000000002,null,{"$f":"IF(S66=\"\",NA(),ROUND(S66,0))","v":705},{"$f":"IF(T66=\"\",NA(),T66)","v":30.925750000000001},null,"G/C Chroma",0,null,null,null,null,null,null,null,null,null,null,"T-Bin11 a",null,{"$f":"IF(G66=\"\",NA(),G66)","v":705},{"$f":"IF(AP66=\"\",NA(),H66*AP66*0.00836/1000)","v":7.555922325599998E-2}]
["T-Bin11 b",-0.913242,"T-Bin11 b",-0.83201199999999997,null,{"$f":"F66+1","v":67},710,12.3506,null,"R-Bin12 a",-0.30880099999999999,null,710,12.3506,null,"G/C Hue",1,{"$f":"R66+1","v":67},710,31.020679999999999,null,"R-Bin12 a",-0.15246499999999999,null,710,31.020679999999999,null,"G/C Hue",0,null,null,null,null,null,null,null,null,null,null,"T-Bin11 b",null,710,7.3308221359999995E-2]
["T-Bin12 a",-0.26727299999999998,"T-Bin12 a",-0.16544300000000001,null,68,715,11.118410000000001,null,"R-Bin12 b",-0.95112699999999994,null,715,11.118410000000001,null,"C Lightness",0,68,715,28.489100000000001,null,"R-Bin12 b",-0.98830899999999999,null,715,28.489100000000001,null,"C Lightness",0,null,null,null,null,null,null,null,null,null,null,"T-Bin12 a",null,715,6.6459183933999993E-2]
["T-Bin12 b",-1.007155,"T-Bin12 b",-0.98510799999999998,null,69,720,10.232659999999999,null,"R-Bin13 a",0.18357799999999999,null,720,10.232659999999999,null,"C Chroma",0,69,720,25.99418,null,"R-Bin13 a",0.16566700000000001,null,720,25.99418,null,"C Chroma",0,null,null,null,null,null,null,null,null,null,null,"T-Bin12 b",null,720,6.1592427071999994E-2]
["T-Bin13 a",0.13145999999999999,"T-Bin13 a",0.145842,null,70,{"$f":"IF(G69=\"\",\"\",IF(INDEX($A$1:$A$500,MATCH(\"Spe*\",$A$1:$A$500,0)+F70)=0,\"\",INDEX($A$1:$A$500,MATCH(\"Spe*\",$A$1:$A$500,0)+F70)))","v":725},{"$f":"IF(H69=\"\",\"\",IF(INDEX($A$1:$A$500,MATCH(\"Spe*\",$A$1:$A$500,0)+F70)=0,\"\",INDEX($B$1:$B$500,MATCH(\"Spe*\",$A$1:$A$500,0)+F70)))","v":9.8008000000000006},null,"R-Bin13 b",-0.98300500000000002,null,725,9.8008000000000006,null,"C Hue",1,70,{"$f":"IF(S69=\"\",\"\",IF(INDEX($C$1:$C$500,MATCH(\"Spe*\",$C$1:$C$500,0)+R70)=0,\"\",INDEX($C$1:$C$500,MATCH(\"Spe*\",$C$1:$C$500,0)+R70)))","v":725},{"$f":"IF(T69=\"\",\"\",IF(INDEX($C$1:$C$500,MATCH(\"Spe*\",$C$1:$C$500,0)+R70)=0,\"\",INDEX($D$1:$D$500,MATCH(\"Spe*\",$C$1:$C$500,0)+R70)))","v":26.140440000000002},null,"R-Bin13 b",-0.986182,null,725,26.140440000000002,null,"C Hue",0,null,null,null,null,null,null,null,null,null,null,"T-Bin13 a",null,725,5.9402648799999999E-2]
["T-Bin13 b",-1.0514220000000001,"T-Bin13 b",-0.98623300000000003,null,71,730,10.161989999999999,null,"R-Bin14 a",0.581565,null,730,10.161989999999999,null,"C/B Lightness",1,71,730,28.3384,null,"R-Bin14 a",0.59894499999999995,null,730,28.3384,null,"C/B Lightness",0,null,null,null,null,null,null,null,null,null,null,"T-Bin13 b",null,730,6.2016592571999991E-2]
["T-Bin14 a",0.54464500000000005,"T-Bin14 a",0.58031600000000005,null,72,735,10.65001,null,"R-Bin14 b",-0.8135,null,735,10.65001,null,"C/B Chroma",0,72,735,31.436419999999998,null,"R-Bin14 b",-0.80079,null,735,31.436419999999998,null,"C/B Chroma",0,null,null,null,null,null,null,null,null,null,null,"T-Bin14 a",null,735,6.5440051446E-2]
["T-Bin14 b",-0.88506099999999999,"T-Bin14 b",-0.801732,null,73,740,11.0448,null,"R-Bin15 a",0.81660200000000005,null,740,11.0448,null,"C/B Hue",-2,73,740,33.732039999999998,null,"R-Bin15 a",0.83754799999999996,null,740,33.732039999999998,null,"C/B Hue",0,null,null,null,null,null,null,null,null,null,null,"T-Bin14 b",null,740,6.8327550719999991E-2]
["T-Bin15 a",0.72215399999999996,"T-Bin15 a",0.82028500000000004,null,74,745,11.26281,null,"R-Bin15 b",-0.57720199999999999,null,745,11.26281,null,"B Lightness",0,74,745,34.829740000000001,null,"R-Bin15 b",-0.54636399999999996,null,745,34.829740000000001,null,"B Lightness",0,null,null,null,null,null,null,null,null,null,null,"T-Bin15 a",null,745,7.0147033241999987E-2]
["T-Bin15 b",-0.69071099999999996,"T-Bin15 b",-0.56096800000000002,null,75,750,11.173349999999999,null,"R-Bin16 a",{"$f":"IF($A$1=\"\",NA(),INDEX($B$1:$B$300,MATCH(J75,$A$1:$A$300,0)))","v":0.985124},null,750,11.173349999999999,null,"B Chroma",-1,75,750,34.294469999999997,null,"R-Bin16 a",{"$f":"IF($C$1=\"\",NA(),INDEX($D$1:$D$300,MATCH(V75,$C$1:$C$300,0)))","v":0.98699499999999996},null,750,34.294469999999997,null,"B Chroma",0,null,null,null,null,null,null,null,null,null,null,"T-Bin15 b",null,750,7.0056904499999989E-2]
["T-Bin16 a",0.90997399999999995,"T-Bin16 a",0.97547899999999998,null,76,755,9.8014100000000006,null,"R-Bin16 b",-0.171848,null,755,9.8014100000000006,null,"B Hue",-1,76,755,29.90155,null,"R-Bin16 b",-0.160751,null,755,29.90155,null,"B Hue",0,null,null,null,null,null,null,null,null,null,null,"T-Bin16 a",null,755,6.1864539637999996E-2]
["T-Bin16 b",-0.269621,"T-Bin16 b",-0.16300799999999999,null,77,760,7.5748499999999996,null,"T-Bin01 a",0.87146100000000004,null,760,7.5748499999999996,null,"B/M Lightness",1,77,760,23.06175,null,"T-Bin01 a",0.96548599999999996,null,760,23.06175,null,"B/M Lightness",0,null,null,null,null,null,null,null,null,null,null,"T-Bin16 b",null,760,4.8127566959999993E-2]
["Rf_Bin01",82,"Rf_Bin01",98,null,78,765,7.42204,null,"T-Bin01 b",0.203593,null,765,7.42204,null,"B/M Chroma",0,78,765,23.77815,null,"T-Bin01 b",0.21945600000000001,null,765,23.77815,null,"B/M Chroma",0,null,null,null,null,null,null,null,null,null,null,"Rf_Bin01",null,765,4.7466914616E-2]
["Rf_Bin02",86,"Rf_Bin02",98,null,79,770,9.3577700000000004,null,"T-Bin02 a",0.73860599999999998,null,770,9.3577700000000004,null,"B/M Hue",3,79,770,30.256830000000001,null,"T-Bin02 a",0.82554799999999995,null,770,30.256830000000001,null,"B/M Hue",0,null,null,null,null,null,null,null,null,null,null,"Rf_Bin02",null,770,6.0237837043999994E-2]
["Rf_Bin03",82,"Rf_Bin03",98,null,80,775,10.22785,null,"T-Bin02 b",0.57584999999999997,null,775,10.22785,null,"M Lightness",1,80,775,33.228470000000002,null,"T-Bin02 b",0.55317799999999995,null,775,33.228470000000002,null,"M Lightness",0,null,null,null,null,null,null,null,null,null,null,"Rf_Bin03",null,775,6.6266240149999989E-2]
["Rf_Bin04",90,"Rf_Bin04",98,null,81,780,10.4739,null,"T-Bin03 a",0.45469500000000002,null,780,10.4739,null,"M Chroma",0,81,780,33.250079999999997,null,"T-Bin03 a",0.55004200000000003,null,780,33.250079999999997,null,"M Chroma",0,null,null,null,null,null,null,null,null,null,null,"Rf_Bin04",null,780,6.8298207119999996E-2]
["Rf_Bin05",92,"Rf_Bin05",97,null,82,"","",null,"T-Bin03 b",0.85168200000000005,null,{"$error":"#N/A"},{"$error":"#N/A"},null,"M Hue",3,82,"","",null,"T-Bin03 b",0.82580200000000004,null,{"$error":"#N/A"},{"$error":"#N/A"},null,"M Hue",0,null,null,null,null,null,null,null,null,null,null,"Rf_Bin05",null,{"$error":"#N/A"},{"$error":"#N/A"}]
["Rf_Bin06",95,"Rf_Bin06",97,null,83,"","",null,"T-Bin04 a",0.115262,null,{"$error":"#N/A"},{"$error":"#N/A"},null,"M/R Lightness",4,83,"","",null,"T-Bin04 a",0.18971399999999999,null,{"$f":"IF(S83=\"\",NA(),ROUND(S83,0))","v":{"$error":"#N/A"}},{"$f":"IF(T83=\"\",NA(),T83)","v":{"$error":"#N/A"}},null,"M/R Lightness",0,null,null,null,null,null,null,null,null,null,null,"Rf_Bin06",null,{"$error":"#N/A"},{"$error":"#N/A"}]
["Rf_Bin07",92,"Rf_Bin07",97,null,84,"","",null,"T-Bin04 b",0.98522200000000004,null,{"$error":"#N/A"},{"$error":"#N/A"},null,"M/R Chroma",1,84,"","",null,"T-Bin04 b",0.97069000000000005,null,{"$error":"#N/A"},{"$error":"#N/A"},null,"M/R Chroma",0,null,null,null,null,null,null,null,null,null,null,"Rf_Bin07",null,{"$error":"#N/A"},{"$error":"#N/A"}]
["Rf_Bin08",90,"Rf_Bin08",98,null,85,"","",null,"T-Bin05 a",-0.14085500000000001,null,{"$error":"#N/A"},{"$error":"#N/A"},null,"M/R Hue",4,85,"","",null,"T-Bin05 a",-9.6110000000000001E-2,null,{"$error":"#N/A"},{"$error":"#N/A"},null,"M/R Hue",0,null,null,null,null,null,null,null,null,null,null,"Rf_Bin08",null,{"$error":"#N/A"},{"$error":"#N/A"}]
["Rf_Bin09",87,"Rf_Bin09",98,null,86,"","",null,"T-Bin05 b",0.97765400000000002,null,{"$error":"#N/A"},{"$error":"#N/A"},null,null,null,86,"","",null,"T-Bin05 b",0.97790500000000002,null,{"$error":"#N/A"},{"$error":"#N/A"},null,null,null,null,null,null,null,null,null,null,null,null,null,"Rf_Bin09",null,{"$error":"#N/A"},{"$error":"#N/A"}]
["Rf_Bin10",80,"Rf_Bin10",98,null,87,"","",null,"T-Bin06 a",-0.53548899999999999,null,{"$error":"#N/A"},{"$error":"#N/A"},null,null,null,87,"","",null,"T-Bin06 a",-0.51084099999999999,null,{"$error":"#N/A"},{"$error":"#N/A"},null,null,null,null,null,null,null,null,null,null,null,null,null,"Rf_Bin10",null,{"$error":"#N/A"},{"$error":"#N/A"}]
["Rf_Bin11",81,"Rf_Bin11",99,null,88,"","",null,"T-Bin06 b",0.84631400000000001,null,{"$error":"#N/A"},{"$error":"#N/A"},null,null,null,88,"","",null,"T-Bin06 b",0.83886799999999995,null,{"$error":"#N/A"},{"$error":"#N/A"},null,null,null,null,null,null,null,null,null,null,null,null,null,"Rf_Bin11",null,{"$error":"#N/A"},{"$error":"#N/A"}]
["Rf_Bin12",86,"Rf_Bin12",98,null,89,"","",null,"T-Bin07 a",-0.804006,null,{"$error":"#N/A"},{"$error":"#N/A"},null,null,null,89,"","",null,"T-Bin07 a",-0.81944600000000001,null,{"$error":"#N/A"},{"$error":"#N/A"},null,null,null,null,null,null,null,null,null,null,null,null,null,"Rf_Bin12",null,{"$error":"#N/A"},{"$error":"#N/A"}]
["Rf_Bin13",87,"Rf_Bin13",98,null,90,"","",null,"T-Bin07 b",0.51369799999999999,null,{"$error":"#N/A"},{"$error":"#N/A"},null,null,null,90,"","",null,"T-Bin07 b",0.54234300000000002,null,{"$error":"#N/A"},{"$error":"#N/A"},null,null,null,null,null,null,null,null,null,null,null,null,null,"Rf_Bin13",null,{"$error":"#N/A"},{"$error":"#N/A"}]
["Rf_Bin14",89,"Rf_Bin14",97,null,91,"","",null,"T-Bin08 a",-0.93110700000000002,null,{"$error":"#N/A"},{"$error":"#N/A"},null,null,null,91,"","",null,"T-Bin08 a",-0.97754600000000003,null,{"$error":"#N/A"},{"$error":"#N/A"},null,null,null,null,null,null,null,null,null,null,null,null,null,"Rf_Bin14",null,{"$error":"#N/A"},{"$error":"#N/A"}]
["Rf_Bin15",80,"Rf_Bin15",97,null,92,"","",null,"T-Bin08 b",0.13547100000000001,null,{"$error":"#N/A"},{"$error":"#N/A"},null,null,null,92,"","",null,"T-Bin08 b",0.131887,null,{"$error":"#N/A"},{"$error":"#N/A"},null,null,null,null,null,null,null,null,null,null,null,null,null,"Rf_Bin15",null,{"$error":"#N/A"},{"$error":"#N/A"}]
["Rf_Bin16",80,"Rf_Bin16",98,null,93,"","",null,"T-Bin09 a",-0.92115000000000002,null,{"$error":"#N/A"},{"$error":"#N/A"},null,null,null,93,"","",null,"T-Bin09 a",-0.97947399999999996,null,{"$error":"#N/A"},{"$error":"#N/A"},null,null,null,null,null,null,null,null,null,null,null,null,null,"Rf_Bin16",null,{"$error":"#N/A"},{"$error":"#N/A"}]
["Chromashift01 [%]",-10,"Chromashift01 [%]",-1,null,94,"","",null,"T-Bin09 b",-0.165129,null,{"$error":"#N/A"},{"$error":"#N/A"},null,null,null,94,"","",null,"T-Bin09 b",-0.15626699999999999,null,{"$error":"#N/A"},{"$error":"#N/A"},null,null,null,null,null,null,null,null,null,null,null,null,null,"Chromashift01 [%]",null,{"$error":"#N/A"},{"$error":"#N/A"}]
["Chromashift02 [%]",-7,"Chromashift02 [%]",-1,null,95,"","",null,"T-Bin10 a",-0.76329599999999997,null,{"$error":"#N/A"},{"$error":"#N/A"},null,null,null,95,"","",null,"T-Bin10 a",-0.85141100000000003,null,{"$error":"#N/A"},{"$error":"#N/A"},null,null,null,null,null,null,null,null,null,null,null,null,null,"Chromashift02 [%]",null,{"$error":"#N/A"},{"$error":"#N/A"}]
["Chromashift03 [%]",-4,"Chromashift03 [%]",-1,null,96,"","",null,"T-Bin10 b",-0.55508500000000005,null,{"$error":"#N/A"},{"$error":"#N/A"},null,null,null,96,"","",null,"T-Bin10 b",-0.52210699999999999,null,{"$error":"#N/A"},{"$error":"#N/A"},null,null,null,null,null,null,null,null,null,null,null,null,null,"Chromashift03 [%]",null,{"$error":"#N/A"},{"$error":"#N/A"}]
["Chromashift04 [%]",-1,"Chromashift04 [%]",-1,null,97,"","",null,"T-Bin11 a",-0.47816599999999998,null,{"$error":"#N/A"},{"$error":"#N/A"},null,null,null,97,"","",null,"T-Bin11 a",-0.55883099999999997,null,{"$error":"#N/A"},{"$error":"#N/A"},null,null,null,null,null,null,null,null,null,null,null,null,null,"Chromashift04 [%]",null,{"$error":"#N/A"},{"$error":"#N/A"}]
["Chromashift05 [%]",-1,"Chromashift05 [%]",-2,null,98,"","",null,"T-Bin11 b",-0.913242,null,{"$error":"#N/A"},{"$error":"#N/A"},null,null,null,98,"","",null,"T-Bin11 b",-0.83201199999999997,null,{"$f":"IF(S98=\"\",NA(),ROUND(S98,0))","v":{"$error":"#N/A"}},{"$f":"IF(T98=\"\",NA(),T98)","v":{"$error":"#N/A"}},null,null,null,null,null,null,null,null,null,null,null,null,null,"Chromashift05 [%]",null,{"$error":"#N/A"},{"$error":"#N/A"}]
["Chromashift06 [%]",0,"Chromashift06 [%]",-2,null,99,"","",null,"T-Bin12 a",-0.26727299999999998,null,{"$error":"#N/A"},{"$error":"#N/A"},null,null,null,99,"","",null,"T-Bin12 a",-0.16544300000000001,null,{"$error":"#N/A"},{"$error":"#N/A"},null,null,null,null,null,null,null,null,null,null,null,null,null,"Chromashift06 [%]",null,{"$error":"#N/A"},{"$error":"#N/A"}]
["Chromashift07 [%]",-5,"Chromashift07 [%]",-2,null,100,"","",null,"T-Bin12 b",-1.007155,null,{"$error":"#N/A"},{"$error":"#N/A"},null,null,null,100,"","",null,"T-Bin12 b",-0.98510799999999998,null,{"$error":"#N/A"},{"$error":"#N/A"},null,null,null,null,null,null,null,null,null,null,null,null,null,"Chromashift07 [%]",null,{"$error":"#N/A"},{"$error":"#N/A"}]
["Chromashift08 [%]",-6,"Chromashift08 [%]",-1,null,101,"","",null,"T-Bin13 a",0.13145999999999999,null,{"$error":"#N/A"},{"$error":"#N/A"},null,null,null,101,"","",null,"T-Bin13 a",0.145842,null,{"$error":"#N/A"},{"$error":"#N/A"},null,null,null,null,null,null,null,null,null,null,null,null,null,"Chromashift08 [%]",null,{"$error":"#N/A"},{"$error":"#N/A"}]
["Chromashift09 [%]",-6,"Chromashift09 [%]",-1,null,102,"","",null,"T-Bin13 b",-1.0514220000000001,null,{"$error":"#N/A"},{"$error":"#N/A"},null,null,null,102,"","",null,"T-Bin13 b",-0.98623300000000003,null,{"$error":"#N/A"},{"$error":"#N/A"},null,null,null,null,null,null,null,null,null,null,null,null,null,"Chromashift09 [%]",null,{"$error":"#N/A"},{"$error":"#N/A"}]
["Chromashift10 [%]",-5,"Chromashift10 [%]",0,null,103,"","",null,"T-Bin14 a",0.54464500000000005,null,{"$error":"#N/A"},{"$error":"#N/A"},null,null,null,103,"","",null,"T-Bin14 a",0.58031600000000005,null,{"$error":"#N/A"},{"$error":"#N/A"},null,null,null,null,null,null,null,null,null,null,null,null,null,"Chromashift10 [%]",null,{"$error":"#N/A"},{"$error":"#N/A"}]
["Chromashift11 [%]",3,"Chromashift11 [%]",0,null,104,"","",null,"T-Bin14 b",-0.88506099999999999,null,{"$error":"#N/A"},{"$error":"#N/A"},null,null,null,104,"","",null,"T-Bin14 b",-0.801732,null,{"$error":"#N/A"},{"$error":"#N/A"},null,null,null,null,null,null,null,null,null,null,null,null,null,"Chromashift11 [%]",null,{"$error":"#N/A"},{"$error":"#N/A"}]
["Chromashift12 [%]",5,"Chromashift12 [%]",0,null,105,"","",null,"T-Bin15 a",0.72215399999999996,null,{"$error":"#N/A"},{"$error":"#N/A"},null,null,null,105,"","",null,"T-Bin15 a",0.82028500000000004,null,{"$error":"#N/A"},{"$error":"#N/A"},null,null,null,null,null,null,null,null,null,null,null,null,null,"Chromashift12 [%]",null,{"$error":"#N/A"},{"$error":"#N/A"}]
["Chromashift13 [%]",6,"Chromashift13 [%]",0,null,106,"","",null,"T-Bin15 b",-0.69071099999999996,null,{"$error":"#N/A"},{"$error":"#N/A"},null,null,null,106,"","",null,"T-Bin15 b",-0.56096800000000002,null,{"$error":"#N/A"},{"$error":"#N/A"},null,null,null,null,null,null,null,null,null,null,null,null,null,"Chromashift13 [%]",null,{"$error":"#N/A"},{"$error":"#N/A"}]
["Chromashift14 [%]",4,"Chromashift14 [%]",-1,null,107,"","",null,"T-Bin16 a",{"$f":"IF($A$1=\"\",NA(),INDEX($B$1:$B$300,MATCH(J107,$A$1:$A$300,0)))","v":0.90997399999999995},null,{"$error":"#N/A"},{"$error":"#N/A"},null,null,null,107,"","",null,"T-Bin16 a",{"$f":"IF($C$1=\"\",NA(),INDEX($D$1:$D$300,MATCH(V107,$C$1:$C$300,0)))","v":0.97547899999999998},null,{"$error":"#N/A"},{"$error":"#N/A"},null,null,null,null,null,null,null,null,null,null,null,null,null,"Chromashift14 [%]",null,{"$error":"#N/A"},{"$error":"#N/A"}]
["Chromashift15 [%]",-2,"Chromashift15 [%]",-1,null,108,"","",null,"T-Bin16 b",-0.269621,null,{"$error":"#N/A"},{"$error":"#N/A"},null,null,null,108,"","",null,"T-Bin16 b",-0.16300799999999999,null,{"$error":"#N/A"},{"$error":"#N/A"},null,null,null,null,null,null,null,null,null,null,null,null,null,"Chromashift15 [%]",null,{"$error":"#N/A"},{"$error":"#N/A"}]
["Chromashift16 [%]",-5,"Chromashift16 [%]",-1,null,109,"","",1,"Rf_Bin01",{"$f":"IF($A$1=\"\",NA(),INDEX($B$1:$B$300,MATCH(J109,$A$1:$A$300,0)))","v":82},null,{"$error":"#N/A"},{"$error":"#N/A"},null,null,null,109,"","",1,"Rf_Bin01",98,null,{"$error":"#N/A"},{"$error":"#N/A"},null,null,null,null,null,null,null,null,null,null,null,null,null,"Chromashift16 [%]",null,{"$error":"#N/A"},{"$error":"#N/A"}]
["Hueshift01",0,"Hueshift01",0,null,110,"","",2,"Rf_Bin02",86,null,{"$error":"#N/A"},{"$error":"#N/A"},null,null,null,110,"","",2,"Rf_Bin02",98,null,{"$error":"#N/A"},{"$error":"#N/A"},null,null,null,null,null,null,null,null,null,null,null,null,null,"Hueshift01",null,{"$error":"#N/A"},{"$error":"#N/A"}]
["Hueshift02",0.05,"Hueshift02",0,null,111,"","",3,"Rf_Bin03",82,null,{"$error":"#N/A"},{"$error":"#N/A"},null,null,null,111,"","",3,"Rf_Bin03",98,null,{"$error":"#N/A"},{"$error":"#N/A"},null,null,null,null,null,null,null,null,null,null,null,null,null,"Hueshift02",null,{"$error":"#N/A"},{"$error":"#N/A"}]
["Hueshift03",0.09,"Hueshift03",-0.01,null,112,"","",4,"Rf_Bin04",90,null,{"$error":"#N/A"},{"$error":"#N/A"},null,null,null,112,"","",4,"Rf_Bin04",98,null,{"$error":"#N/A"},{"$error":"#N/A"},null,null,null,null,null,null,null,null,null,null,null,null,null,"Hueshift03",null,{"$error":"#N/A"},{"$error":"#N/A"}]
["Hueshift04",0.05,"Hueshift04",-0.01,null,113,"","",5,"Rf_Bin05",92,null,{"$error":"#N/A"},{"$error":"#N/A"},null,null,null,113,"","",5,"Rf_Bin05",97,null,{"$error":"#N/A"},{"$error":"#N/A"},null,null,null,null,null,null,null,null,null,null,null,null,null,"Hueshift04",null,{"$error":"#N/A"},{"$error":"#N/A"}]
["Hueshift05",0.03,"Hueshift05",-0.01,null,114,"","",6,"Rf_Bin06",95,null,{"$error":"#N/A"},{"$error":"#N/A"},null,null,null,114,"","",6,"Rf_Bin06",97,null,{"$error":"#N/A"},{"$error":"#N/A"},null,null,null,null,null,null,null,null,null,null,null,null,null,"Hueshift05",null,{"$error":"#N/A"},{"$error":"#N/A"}]
["Hueshift06",-0.01,"Hueshift06",0,null,115,"","",7,"Rf_Bin07",92,null,{"$error":"#N/A"},{"$error":"#N/A"},null,null,null,115,"","",7,"Rf_Bin07",97,null,{"$error":"#N/A"},{"$error":"#N/A"},null,null,null,null,null,null,null,null,null,null,null,null,null,"Hueshift06",null,{"$error":"#N/A"},{"$error":"#N/A"}]
["Hueshift07",-0.02,"Hueshift07",0,null,116,"","",8,"Rf_Bin08",90,null,{"$error":"#N/A"},{"$error":"#N/A"},null,null,null,116,"","",8,"Rf_Bin08",98,null,{"$error":"#N/A"},{"$error":"#N/A"},null,null,null,null,null,null,null,null,null,null,null,null,null,"Hueshift07",null,{"$error":"#N/A"},{"$error":"#N/A"}]
["Hueshift08",0,"Hueshift08",0.01,null,117,"","",9,"Rf_Bin09",87,null,{"$error":"#N/A"},{"$error":"#N/A"},null,null,null,117,"","",9,"Rf_Bin09",98,null,{"$error":"#N/A"},{"$error":"#N/A"},null,null,null,null,null,null,null,null,null,null,null,null,null,"Hueshift08",null,{"$error":"#N/A"},{"$error":"#N/A"}]
["Hueshift09",0.06,"Hueshift09",0.01,null,118,"","",10,"Rf_Bin10",80,null,{"$error":"#N/A"},{"$error":"#N/A"},null,null,null,118,"","",10,"Rf_Bin10",98,null,{"$error":"#N/A"},{"$error":"#N/A"},null,null,null,null,null,null,null,null,null,null,null,null,null,"Hueshift09",null,{"$error":"#N/A"},{"$error":"#N/A"}]
["Hueshift10",0.11,"Hueshift10",0.01,null,119,"","",11,"Rf_Bin11",81,null,{"$error":"#N/A"},{"$error":"#N/A"},null,null,null,119,"","",11,"Rf_Bin11",99,null,{"$error":"#N/A"},{"$error":"#N/A"},null,null,null,null,null,null,null,null,null,null,null,null,null,"Hueshift10",null,{"$error":"#N/A"},{"$error":"#N/A"}]
["Hueshift11",0.12,"Hueshift11",0,null,120,"","",12,"Rf_Bin12",86,null,{"$error":"#N/A"},{"$error":"#N/A"},null,null,null,120,"","",12,"Rf_Bin12",98,null,{"$error":"#N/A"},{"$error":"#N/A"},null,null,null,null,null,null,null,null,null,null,null,null,null,"Hueshift11",null,{"$error":"#N/A"},{"$error":"#N/A"}]
["Hueshift12",0.05,"Hueshift12",-0.01,null,121,"","",13,"Rf_Bin13",87,null,{"$error":"#N/A"},{"$error":"#N/A"},null,null,null,121,"","",13,"Rf_Bin13",98,null,{"$error":"#N/A"},{"$error":"#N/A"},null,null,null,null,null,null,null,null,null,null,null,null,null,"Hueshift12",null,{"$error":"#N/A"},{"$error":"#N/A"}]
["Hueshift13",-0.06,"Hueshift13",-0.02,null,122,"","",14,"Rf_Bin14",89,null,{"$error":"#N/A"},{"$error":"#N/A"},null,null,null,122,"","",14,"Rf_Bin14",97,null,{"$error":"#N/A"},{"$error":"#N/A"},null,null,null,null,null,null,null,null,null,null,null,null,null,"Hueshift13",null,{"$error":"#N/A"},{"$error":"#N/A"}]
["Hueshift14",-7.0000000000000007E-2,"Hueshift14",-0.02,null,123,"","",15,"Rf_Bin15",80,null,{"$error":"#N/A"},{"$error":"#N/A"},null,null,null,123,"","",15,"Rf_Bin15",97,null,{"$error":"#N/A"},{"$error":"#N/A"},null,null,null,null,null,null,null,null,null,null,null,null,null,"Hueshift14",null,{"$error":"#N/A"},{"$error":"#N/A"}]
["Hueshift15",-0.15,"Hueshift15",-0.02,null,124,"","",16,"Rf_Bin16",80,null,{"$error":"#N/A"},{"$error":"#N/A"},null,null,null,124,"","",16,"Rf_Bin16",98,null,{"$error":"#N/A"},{"$error":"#N/A"},null,null,null,null,null,null,null,null,null,null,null,null,null,"Hueshift15",null,{"$error":"#N/A"},{"$error":"#N/A"}]
["Hueshift16",-0.11,"Hueshift16",0,null,125,"","",1,"Chromashift01 [%]",-10,null,{"$error":"#N/A"},{"$error":"#N/A"},null,null,null,125,"","",1,"Chromashift01 [%]",-1,null,{"$error":"#N/A"},{"$error":"#N/A"},null,null,null,null,null,null,null,null,null,null,null,null,null,"Hueshift16",null,{"$error":"#N/A"},{"$error":"#N/A"}]
["Flicker Index",5.0999999999999997E-2,"Flicker Index",2E-3,null,126,"","",2,"Chromashift02 [%]",-7,null,{"$error":"#N/A"},{"$error":"#N/A"},null,null,null,126,"","",2,"Chromashift02 [%]",-1,null,{"$error":"#N/A"},{"$error":"#N/A"},null,null,null,null,null,null,null,null,null,null,null,null,null,"Flicker Index",null,{"$error":"#N/A"},{"$error":"#N/A"}]
["Flicker [Hz]",99.9,"Flicker [Hz]",0,null,127,"","",3,"Chromashift03 [%]",-4,null,{"$error":"#N/A"},{"$error":"#N/A"},null,null,null,127,"","",3,"Chromashift03 [%]",-1,null,{"$error":"#N/A"},{"$error":"#N/A"},null,null,null,null,null,null,null,null,null,null,null,null,null,"Flicker [Hz]",null,{"$error":"#N/A"},{"$error":"#N/A"}]
["Flicker [%]",17.2,"Flicker [%]",1,null,128,"","",4,"Chromashift04 [%]",-1,null,{"$error":"#N/A"},{"$error":"#N/A"},null,null,null,128,"","",4,"Chromashift04 [%]",-1,null,{"$error":"#N/A"},{"$error":"#N/A"},null,null,null,null,null,null,null,null,null,null,null,null,null,"Flicker [%]",null,{"$error":"#N/A"},{"$error":"#N/A"}]
["Ra",84.72,"Ra",97.6,null,129,"","",5,"Chromashift05 [%]",-1,null,{"$error":"#N/A"},{"$error":"#N/A"},null,null,null,129,"","",5,"Chromashift05 [%]",-2,null,{"$error":"#N/A"},{"$error":"#N/A"},null,null,null,null,null,null,null,null,null,null,null,null,null,"Ra",null,{"$error":"#N/A"},{"$error":"#N/A"}]
["Re",78.510000000000005,"Re",96.84,null,130,"","",6,"Chromashift06 [%]",0,null,{"$f":"IF(G130=\"\",NA(),ROUND(G130,0))","v":{"$error":"#N/A"}},{"$f":"IF(H130=\"\",NA(),H130)","v":{"$error":"#N/A"}},null,null,null,130,"","",6,"Chromashift06 [%]",-2,null,{"$error":"#N/A"},{"$error":"#N/A"},null,null,null,null,null,null,null,null,null,null,null,null,null,"Re",null,{"$f":"IF(G130=\"\",NA(),G130)","v":{"$error":"#N/A"}},{"$f":"IF(AP130=\"\",NA(),H130*AP130*0.00836/1000)","v":{"$error":"#N/A"}}]
["GAI",70.459999999999994,"GAI",84.82,null,{"$f":"F130+1","v":131},"","",7,"Chromashift07 [%]",-5,null,{"$error":"#N/A"},{"$error":"#N/A"},null,null,null,{"$f":"R130+1","v":131},"","",7,"Chromashift07 [%]",-2,null,{"$error":"#N/A"},{"$error":"#N/A"},null,null,null,null,null,null,null,null,null,null,null,null,null,"GAI",null,{"$error":"#N/A"},{"$error":"#N/A"}]
["R1",82.78,"R1",97.11,null,132,"","",8,"Chromashift08 [%]",-6,null,{"$error":"#N/A"},{"$error":"#N/A"},null,null,null,132,"","",8,"Chromashift08 [%]",-1,null,{"$error":"#N/A"},{"$error":"#N/A"},null,null,null,null,null,null,null,null,null,null,null,null,null,"R1",null,{"$error":"#N/A"},{"$error":"#N/A"}]
["R2",90.11,"R2",98.31,null,133,"","",9,"Chromashift09 [%]",-6,null,{"$error":"#N/A"},{"$error":"#N/A"},null,null,null,133,"","",9,"Chromashift09 [%]",-1,null,{"$error":"#N/A"},{"$error":"#N/A"},null,null,null,null,null,null,null,null,null,null,null,null,null,"R2",null,{"$error":"#N/A"},{"$error":"#N/A"}]
["R3",95.97,"R3",98.94,null,134,{"$f":"IF(G133=\"\",\"\",IF(INDEX($A$1:$A$500,MATCH(\"Spe*\",$A$1:$A$500,0)+F134)=0,\"\",INDEX($A$1:$A$500,MATCH(\"Spe*\",$A$1:$A$500,0)+F134)))","v":""},{"$f":"IF(H133=\"\",\"\",IF(INDEX($A$1:$A$500,MATCH(\"Spe*\",$A$1:$A$500,0)+F134)=0,\"\",INDEX($B$1:$B$500,MATCH(\"Spe*\",$A$1:$A$500,0)+F134)))","v":""},10,"Chromashift10 [%]",-5,null,{"$error":"#N/A"},{"$error":"#N/A"},null,null,null,134,{"$f":"IF(S133=\"\",\"\",IF(INDEX($C$1:$C$500,MATCH(\"Spe*\",$C$1:$C$500,0)+R134)=0,\"\",INDEX($C$1:$C$500,MATCH(\"Spe*\",$C$1:$C$500,0)+R134)))","v":""},{"$f":"IF(T133=\"\",\"\",IF(INDEX($C$1:$C$500,MATCH(\"Spe*\",$C$1:$C$500,0)+R134)=0,\"\",INDEX($D$1:$D$500,MATCH(\"Spe*\",$C$1:$C$500,0)+R134)))","v":""},10,"Chromashift10 [%]",0,null,{"$error":"#N/A"},{"$error":"#N/A"},null,null,null,null,null,null,null,null,null,null,null,null,null,"R3",null,{"$error":"#N/A"},{"$error":"#N/A"}]
["R4",83.5,"R4",96.5,null,135,"","",11,"Chromashift11 [%]",3,null,{"$error":"#N/A"},{"$error":"#N/A"},null,null,null,135,"","",11,"Chromashift11 [%]",0,null,{"$error":"#N/A"},{"$error":"#N/A"},null,null,null,null,null,null,null,null,null,null,null,null,null,"R4",null,{"$error":"#N/A"},{"$error":"#N/A"}]
["R5",82.71,"R5",97.12,null,136,"","",12,"Chromashift12 [%]",5,null,{"$error":"#N/A"},{"$error":"#N/A"},null,null,null,136,"","",12,"Chromashift12 [%]",0,null,{"$error":"#N/A"},{"$error":"#N/A"},null,null,null,null,null,null,null,null,null,null,null,null,null,"R5",null,{"$error":"#N/A"},{"$error":"#N/A"}]
["R6",86.5,"R6",98.12,null,137,"","",13,"Chromashift13 [%]",6,null,{"$error":"#N/A"},{"$error":"#N/A"},null,null,null,137,"","",13,"Chromashift13 [%]",0,null,{"$error":"#N/A"},{"$error":"#N/A"},null,null,null,null,null,null,null,null,null,null,null,null,null,"R6",null,{"$error":"#N/A"},{"$error":"#N/A"}]
["R7",88.13,"R7",98.39,null,138,"","",14,"Chromashift14 [%]",4,null,{"$error":"#N/A"},{"$error":"#N/A"},null,null,null,138,"","",14,"Chromashift14 [%]",-1,null,{"$error":"#N/A"},{"$error":"#N/A"},null,null,null,null,null,null,null,null,null,null,null,null,null,"R7",null,{"$error":"#N/A"},{"$error":"#N/A"}]
["R8",68.09,"R8",96.29,null,139,"","",15,"Chromashift15 [%]",{"$f":"IF($A$1=\"\",NA(),INDEX($B$1:$B$300,MATCH(J139,$A$1:$A$300,0)))","v":-2},null,{"$error":"#N/A"},{"$error":"#N/A"},null,null,null,139,"","",15,"Chromashift15 [%]",{"$f":"IF($C$1=\"\",NA(),INDEX($D$1:$D$300,MATCH(V139,$C$1:$C$300,0)))","v":-1},null,{"$error":"#N/A"},{"$error":"#N/A"},null,null,null,null,null,null,null,null,null,null,null,null,null,"R8",null,{"$error":"#N/A"},{"$error":"#N/A"}]
["R9",17.21,"R9",90.19,null,140,"","",16,"Chromashift16 [%]",-5,null,{"$error":"#N/A"},{"$error":"#N/A"},null,null,null,140,"","",16,"Chromashift16 [%]",-1,null,{"$error":"#N/A"},{"$error":"#N/A"},null,null,null,null,null,null,null,null,null,null,null,null,null,"R9",null,{"$error":"#N/A"},{"$error":"#N/A"}]
["R10",76.650000000000006,"R10",97.04,null,141,"","",1,"Hueshift01",0,null,{"$error":"#N/A"},{"$error":"#N/A"},null,null,null,141,"","",1,"Hueshift01",0,null,{"$error":"#N/A"},{"$error":"#N/A"},null,null,null,null,null,null,null,null,null,null,null,null,null,"R10",null,{"$error":"#N/A"},{"$error":"#N/A"}]
["R11",82.47,"R11",96.22,null,142,"","",2,"Hueshift02",0.05,null,{"$error":"#N/A"},{"$error":"#N/A"},null,null,null,142,"","",2,"Hueshift02",0,null,{"$error":"#N/A"},{"$error":"#N/A"},null,null,null,null,null,null,null,null,null,null,null,null,null,"R11",null,{"$error":"#N/A"},{"$error":"#N/A"}]
["R12",64.47,"R12",96.12,null,143,"","",3,"Hueshift03",0.09,null,{"$error":"#N/A"},{"$error":"#N/A"},null,null,null,143,"","",3,"Hueshift03",-0.01,null,{"$error":"#N/A"},{"$error":"#N/A"},null,null,null,null,null,null,null,null,null,null,null,null,null,"R12",null,{"$error":"#N/A"},{"$error":"#N/A"}]
["R13",84.59,"R13",97.25,null,144,"","",4,"Hueshift04",0.05,null,{"$error":"#N/A"},{"$error":"#N/A"},null,null,null,144,"","",4,"Hueshift04",-0.01,null,{"$error":"#N/A"},{"$error":"#N/A"},null,null,null,null,null,null,null,null,null,null,null,null,null,"R13",null,{"$error":"#N/A"},{"$error":"#N/A"}]
["R14",97.9,"R14",99.22,null,145,"","",5,"Hueshift05",0.03,null,{"$error":"#N/A"},{"$error":"#N/A"},null,null,null,145,"","",5,"Hueshift05",-0.01,null,{"$error":"#N/A"},{"$error":"#N/A"},null,null,null,null,null,null,null,null,null,null,null,null,null,"R14",null,{"$error":"#N/A"},{"$error":"#N/A"}]
["R15",76.53,"R15",95.84,null,146,"","",6,"Hueshift06",-0.01,null,{"$error":"#N/A"},{"$error":"#N/A"},null,null,null,146,"","",6,"Hueshift06",0,null,{"$error":"#N/A"},{"$error":"#N/A"},null,null,null,null,null,null,null,null,null,null,null,null,null,"R15",null,{"$error":"#N/A"},{"$error":"#N/A"}]
["x",0.38190000000000002,"x",0.34260000000000002,null,147,"","",7,"Hueshift07",-0.02,null,{"$error":"#N/A"},{"$error":"#N/A"},null,null,null,147,"","",7,"Hueshift07",0,null,{"$error":"#N/A"},{"$error":"#N/A"},null,null,null,null,null,null,null,null,null,null,null,null,null,"x",null,{"$error":"#N/A"},{"$error":"#N/A"}]
["y",0.38419999999999999,"y",0.36370000000000002,null,148,"","",8,"Hueshift08",0,null,{"$error":"#N/A"},{"$error":"#N/A"},null,null,null,148,"","",8,"Hueshift08",0.01,null,{"$error":"#N/A"},{"$error":"#N/A"},null,null,null,null,null,null,null,null,null,null,null,null,null,"y",null,{"$error":"#N/A"},{"$error":"#N/A"}]
["u'",0.22309999999999999,"u'",0.20519999999999999,null,149,"","",9,"Hueshift09",0.06,null,{"$error":"#N/A"},{"$error":"#N/A"},null,null,null,149,"","",9,"Hueshift09",0.01,null,{"$error":"#N/A"},{"$error":"#N/A"},null,null,null,null,null,null,null,null,null,null,null,null,null,"u'",null,{"$error":"#N/A"},{"$error":"#N/A"}]
["v'",0.505,"v'",0.49009999999999998,null,150,"","",10,"Hueshift10",0.11,null,{"$error":"#N/A"},{"$error":"#N/A"},null,null,null,150,"","",10,"Hueshift10",0.01,null,{"$error":"#N/A"},{"$error":"#N/A"},null,null,null,null,null,null,null,null,null,null,null,null,null,"v'",null,{"$error":"#N/A"},{"$error":"#N/A"}]
["u",0.22309999999999999,"u",0.20519999999999999,null,151,"","",11,"Hueshift11",0.12,null,{"$error":"#N/A"},{"$error":"#N/A"},null,null,null,151,"","",11,"Hueshift11",0,null,{"$error":"#N/A"},{"$error":"#N/A"},null,null,null,null,null,null,null,null,null,null,null,null,null,"u",null,{"$error":"#N/A"},{"$error":"#N/A"}]
["v",0.3367,"v",0.32669999999999999,null,152,"","",12,"Hueshift12",0.05,null,{"$error":"#N/A"},{"$error":"#N/A"},null,null,null,152,"","",12,"Hueshift12",-0.01,null,{"$error":"#N/A"},{"$error":"#N/A"},null,null,null,null,null,null,null,null,null,null,null,null,null,"v",null,{"$error":"#N/A"},{"$error":"#N/A"}]
["PPFD",45.52,"PPFD",42.63,null,153,"","",13,"Hueshift13",-0.06,null,{"$error":"#N/A"},{"$error":"#N/A"},null,null,null,153,"","",13,"Hueshift13",-0.02,null,{"$error":"#N/A"},{"$error":"#N/A"},null,null,null,null,null,null,null,null,null,null,null,null,null,"PPFD",null,{"$error":"#N/A"},{"$error":"#N/A"}]
["PPFD_UV",7.0000000000000007E-2,"PPFD_UV",0.46,null,154,"","",14,"Hueshift14",-7.0000000000000007E-2,null,{"$error":"#N/A"},{"$error":"#N/A"},null,null,null,154,"","",14,"Hueshift14",-0.02,null,{"$error":"#N/A"},{"$error":"#N/A"},null,null,null,null,null,null,null,null,null,null,null,null,null,"PPFD_UV",null,{"$error":"#N/A"},{"$error":"#N/A"}]
["PPFD_Blau",7.94,"PPFD_Blau",9.9,null,155,"","",15,"Hueshift15",{"$f":"IF($A$1=\"\",NA(),INDEX($B$1:$B$300,MATCH(J155,$A$1:$A$300,0)))","v":-0.15},null,{"$error":"#N/A"},{"$error":"#N/A"},null,null,null,155,"","",15,"Hueshift15",{"$f":"IF($C$1=\"\",NA(),INDEX($D$1:$D$300,MATCH(V155,$C$1:$C$300,0)))","v":-0.02},null,{"$error":"#N/A"},{"$error":"#N/A"},null,null,null,null,null,null,null,null,null,null,null,null,null,"PPFD_Blau",null,{"$error":"#N/A"},{"$error":"#N/A"}]
["PPFD_Grün",20.51,"PPFD_Grün",15.67,null,156,"","",16,"Hueshift16",-0.11,null,{"$error":"#N/A"},{"$error":"#N/A"},null,null,null,156,"","",16,"Hueshift16",0,null,{"$error":"#N/A"},{"$error":"#N/A"},null,null,null,null,null,null,null,null,null,null,null,null,null,"PPFD_Grün",null,{"$error":"#N/A"},{"$error":"#N/A"}]
["PPFD_Rot",17.07,"PPFD_Rot",17.059999999999999,null,157,"","",null,null,null,null,{"$error":"#N/A"},{"$error":"#N/A"},null,null,null,157,"","",null,null,null,null,{"$error":"#N/A"},{"$error":"#N/A"},null,null,null,null,null,null,null,null,null,null,null,null,null,"PPFD_Rot",null,{"$error":"#N/A"},{"$error":"#N/A"}]
["PPFD_FR",5.15,"PPFD_FR",14.76,null,158,"","",null,"PPFD",{"$f":"IF($A$1=\"\",NA(),INDEX($B$1:$B$300,MATCH(J158,$A$1:$A$300,0)))","v":45.52},null,{"$error":"#N/A"},{"$error":"#N/A"},null,null,null,158,"","",null,"PPFD",{"$f":"IF($C$1=\"\",NA(),INDEX($D$1:$D$300,MATCH(V158,$C$1:$C$300,0)))","v":42.63},null,{"$error":"#N/A"},{"$error":"#N/A"},null,null,null,null,null,null,null,null,null,null,null,null,null,"PPFD_FR",null,{"$error":"#N/A"},{"$error":"#N/A"}]
["TLCI",75,"TLCI",100,null,159,"","",null,"PPFD_UV",{"$f":"IF($A$1=\"\",NA(),INDEX($B$1:$B$300,MATCH(J159,$A$1:$A$300,0)))","v":7.0000000000000007E-2},null,{"$error":"#N/A"},{"$error":"#N/A"},null,null,null,159,"","",null,"PPFD_UV",{"$f":"IF($C$1=\"\",NA(),INDEX($D$1:$D$300,MATCH(V159,$C$1:$C$300,0)))","v":0.46},null,{"$error":"#N/A"},{"$error":"#N/A"},null,null,null,null,null,null,null,null,null,null,null,null,null,"TLCI",null,{"$error":"#N/A"},{"$error":"#N/A"}]
["Q1",80,"Q1",99,null,160,"","",null,"PPFD_Blau",null,null,{"$error":"#N/A"},{"$error":"#N/A"},null,null,null,160,"","",null,"PPFD_Blau",null,null,{"$error":"#N/A"},{"$error":"#N/A"},null,null,null,null,null,null,null,null,null,null,null,null,null,"Q1",null,{"$error":"#N/A"},{"$error":"#N/A"}]
["Q2",86,"Q2",99,null,161,"","",null,"PPFD_Blue",{"$f":"IF(ISNA(MATCH(J160,$A$1:$A$300,0)),IF($A$1=\"\",NA(),INDEX($B$1:$B$300,MATCH(J161,$A$1:$A$300,0))),IF($A$1=\"\",NA(),INDEX($B$1:$B$300,MATCH(J160,$A$1:$A$300,0))))","v":7.94},null,{"$error":"#N/A"},{"$error":"#N/A"},null,null,null,161,"","",null,"PPFD_Blue",{"$f":"IF(ISNA(MATCH(V160,$C$1:$C$300,0)),IF($C$1=\"\",NA(),INDEX($D$1:$D$300,MATCH(V161,$C$1:$C$300,0))),IF($C$1=\"\",NA(),INDEX($D$1:$D$300,MATCH(V160,$C$1:$C$300,0))))","v":9.9},null,{"$error":"#N/A"},{"$error":"#N/A"},null,null,null,null,null,null,null,null,null,null,null,null,null,"Q2",null,{"$error":"#N/A"},{"$error":"#N/A"}]
["Q3",86,"Q3",99,null,162,"","",null,"PPFD_Grün",null,null,{"$error":"#N/A"},{"$error":"#N/A"},null,null,null,162,"","",null,"PPFD_Grün",null,null,{"$f":"IF(S162=\"\",NA(),ROUND(S162,0))","v":{"$error":"#N/A"}},{"$f":"IF(T162=\"\",NA(),T162)","v":{"$error":"#N/A"}},null,null,null,null,null,null,null,null,null,null,null,null,null,"Q3",null,{"$error":"#N/A"},{"$error":"#N/A"}]
["Q4",89,"Q4",99,null,163,"","",null,"PPFD_Green",{"$f":"IF(ISNA(MATCH(J162,$A$1:$A$300,0)),IF($A$1=\"\",NA(),INDEX($B$1:$B$300,MATCH(J163,$A$1:$A$300,0))),IF($A$1=\"\",NA(),INDEX($B$1:$B$300,MATCH(J162,$A$1:$A$300,0))))","v":20.51},null,{"$error":"#N/A"},{"$error":"#N/A"},null,null,null,163,"","",null,"PPFD_Green",{"$f":"IF(ISNA(MATCH(V162,$C$1:$C$300,0)),IF($C$1=\"\",NA(),INDEX($D$1:$D$300,MATCH(V163,$C$1:$C$300,0))),IF($C$1=\"\",NA(),INDEX($D$1:$D$300,MATCH(V162,$C$1:$C$300,0))))","v":15.67},null,{"$error":"#N/A"},{"$error":"#N/A"},null,null,null,null,null,null,null,null,null,null,null,null,null,"Q4",null,{"$error":"#N/A"},{"$error":"#N/A"}]
["Q5",99,"Q5",99,null,164,"","",null,"PPFD_Rot",null,null,{"$error":"#N/A"},{"$error":"#N/A"},null,null,null,164,"","",null,"PPFD_Rot",null,null,{"$error":"#N/A"},{"$error":"#N/A"},null,null,null,null,null,null,null,null,null,null,null,null,null,"Q5",null,{"$error":"#N/A"},{"$error":"#N/A"}]
["Q6",76,"Q6",99,null,165,"","",null,"PPFD_Red",{"$f":"IF(ISNA(MATCH(J164,$A$1:$A$300,0)),IF($A$1=\"\",NA(),INDEX($B$1:$B$300,MATCH(J165,$A$1:$A$300,0))),IF($A$1=\"\",NA(),INDEX($B$1:$B$300,MATCH(J164,$A$1:$A$300,0))))","v":17.07},null,{"$error":"#N/A"},{"$error":"#N/A"},null,null,null,165,"","",null,"PPFD_Red",{"$f":"IF(ISNA(MATCH(V164,$C$1:$C$300,0)),IF($C$1=\"\",NA(),INDEX($D$1:$D$300,MATCH(V165,$C$1:$C$300,0))),IF($C$1=\"\",NA(),INDEX($D$1:$D$300,MATCH(V164,$C$1:$C$300,0))))","v":17.059999999999999},null,{"$error":"#N/A"},{"$error":"#N/A"},null,null,null,null,null,null,null,null,null,null,null,null,null,"Q6",null,{"$error":"#N/A"},{"$error":"#N/A"}]
["Q7",95,"Q7",99,null,166,"","",null,"PPFD_FR",{"$f":"IF($A$1=\"\",NA(),INDEX($B$1:$B$300,MATCH(J166,$A$1:$A$300,0)))","v":5.15},null,{"$error":"#N/A"},{"$error":"#N/A"},null,null,null,166,"","",null,"PPFD_FR",{"$f":"IF($C$1=\"\",NA(),INDEX($D$1:$D$300,MATCH(V166,$C$1:$C$300,0)))","v":14.76},null,{"$error":"#N/A"},{"$error":"#N/A"},null,null,null,null,null,null,null,null,null,null,null,null,null,"Q7",null,{"$error":"#N/A"},{"$error":"#N/A"}]
["Q8",86,"Q8",99,null,167,"","",null,null,null,null,{"$error":"#N/A"},{"$error":"#N/A"},null,null,null,167,"","",null,null,null,null,{"$error":"#N/A"},{"$error":"#N/A"},null,null,null,null,null,null,null,null,null,null,null,null,null,"Q8",null,{"$error":"#N/A"},{"$error":"#N/A"}]
["Q9",96,"Q9",99,null,168,"","",null,null,null,null,{"$error":"#N/A"},{"$error":"#N/A"},null,null,null,168,"","",null,null,null,null,{"$error":"#N/A"},{"$error":"#N/A"},null,null,null,null,null,null,null,null,null,null,null,null,null,"Q9",null,{"$error":"#N/A"},{"$error":"#N/A"}]
["Q10",85,"Q10",99,null,169,"","",null,null,null,null,{"$error":"#N/A"},{"$error":"#N/A"},null,null,null,169,"","",null,null,null,null,{"$error":"#N/A"},{"$error":"#N/A"},null,null,null,null,null,null,null,null,null,null,null,null,null,"Q10",null,{"$error":"#N/A"},{"$error":"#N/A"}]
["Q11",58,"Q11",99,null,170,"","",null,null,null,null,{"$error":"#N/A"},{"$error":"#N/A"},null,null,null,170,"","",null,null,null,null,{"$error":"#N/A"},{"$error":"#N/A"},null,null,null,null,null,null,null,null,null,null,null,null,null,"Q11",null,{"$error":"#N/A"},{"$error":"#N/A"}]
["Q12",96,"Q12",99,null,171,"","",null,null,null,null,{"$error":"#N/A"},{"$error":"#N/A"},null,null,null,171,"","",null,null,null,null,{"$error":"#N/A"},{"$error":"#N/A"},null,null,null,null,null,null,null,null,null,null,null,null,null,"Q12",null,{"$error":"#N/A"},{"$error":"#N/A"}]
["Q13",83,"Q13",99,null,172,"","",null,null,null,null,{"$error":"#N/A"},{"$error":"#N/A"},null,null,null,172,"","",null,null,null,null,{"$error":"#N/A"},{"$error":"#N/A"},null,null,null,null,null,null,null,null,null,null,null,null,null,"Q13",null,{"$error":"#N/A"},{"$error":"#N/A"}]
["Q14",92,"Q14",99,null,173,"","",null,null,null,null,{"$error":"#N/A"},{"$error":"#N/A"},null,null,null,173,"","",null,null,null,null,{"$error":"#N/A"},{"$error":"#N/A"},null,null,null,null,null,null,null,null,null,null,null,null,null,"Q14",null,{"$error":"#N/A"},{"$error":"#N/A"}]
["Q15",93,"Q15",99,null,174,"","",null,null,null,null,{"$error":"#N/A"},{"$error":"#N/A"},null,null,null,174,"","",null,null,null,null,{"$error":"#N/A"},{"$error":"#N/A"},null,null,null,null,null,null,null,null,null,null,null,null,null,"Q15",null,{"$error":"#N/A"},{"$error":"#N/A"}]
["Q16",50,"Q16",99,null,175,"","",null,null,null,null,{"$error":"#N/A"},{"$error":"#N/A"},null,null,null,175,"","",null,null,null,null,{"$error":"#N/A"},{"$error":"#N/A"},null,null,null,null,null,null,null,null,null,null,null,null,null,"Q16",null,{"$error":"#N/A"},{"$error":"#N/A"}]
["Q17",93,"Q17",99,null,176,"","",null,null,null,null,{"$error":"#N/A"},{"$error":"#N/A"},null,null,null,176,"","",null,null,null,null,{"$error":"#N/A"},{"$error":"#N/A"},null,null,null,null,null,null,null,null,null,null,null,null,null,"Q17",null,{"$error":"#N/A"},{"$error":"#N/A"}]
["Q18",51,"Q18",99,null,177,"","",null,null,null,null,{"$error":"#N/A"},{"$error":"#N/A"},null,null,null,177,"","",null,null,null,null,{"$error":"#N/A"},{"$error":"#N/A"},null,null,null,null,null,null,null,null,null,null,null,null,null,"Q18",null,{"$error":"#N/A"},{"$error":"#N/A"}]
["R Lightness",3,"R Lightness",0,null,178,"","",null,null,null,null,{"$error":"#N/A"},{"$error":"#N/A"},null,null,null,178,"","",null,null,null,null,{"$error":"#N/A"},{"$error":"#N/A"},null,null,null,null,null,null,null,null,null,null,null,null,null,"R Lightness",null,{"$error":"#N/A"},{"$error":"#N/A"}]
["R Chroma",2,"R Chroma",0,null,179,"","",null,null,null,null,{"$error":"#N/A"},{"$error":"#N/A"},null,null,null,179,"","",null,null,null,null,{"$error":"#N/A"},{"$error":"#N/A"},null,null,null,null,null,null,null,null,null,null,null,null,null,"R Chroma",null,{"$error":"#N/A"},{"$error":"#N/A"}]
["R Hue",0,"R Hue",0,null,180,"","",null,null,null,null,{"$error":"#N/A"},{"$error":"#N/A"},null,null,null,180,"","",null,null,null,null,{"$error":"#N/A"},{"$error":"#N/A"},null,null,null,null,null,null,null,null,null,null,null,null,null,"R Hue",null,{"$error":"#N/A"},{"$error":"#N/A"}]
["R/Y Lightness",0,"R/Y Lightness",0,null,181,"","",null,null,null,null,{"$error":"#N/A"},{"$error":"#N/A"},null,null,null,181,"","",null,null,null,null,{"$error":"#N/A"},{"$error":"#N/A"},null,null,null,null,null,null,null,null,null,null,null,null,null,"R/Y Lightness",null,{"$error":"#N/A"},{"$error":"#N/A"}]
["R/Y Chroma",1,"R/Y Chroma",0,null,182,"","",null,null,null,null,{"$error":"#N/A"},{"$error":"#N/A"},null,null,null,182,"","",null,null,null,null,{"$error":"#N/A"},{"$error":"#N/A"},null,null,null,null,null,null,null,null,null,null,null,null,null,"R/Y Chroma",null,{"$error":"#N/A"},{"$error":"#N/A"}]
["R/Y Hue",-2,"R/Y Hue",0,null,183,"","",null,null,null,null,{"$error":"#N/A"},{"$error":"#N/A"},null,null,null,183,"","",null,null,null,null,{"$error":"#N/A"},{"$error":"#N/A"},null,null,null,null,null,null,null,null,null,null,null,null,null,"R/Y Hue",null,{"$error":"#N/A"},{"$error":"#N/A"}]
["Y Lightness",0,"Y Lightness",0,null,184,"","",null,null,null,null,{"$error":"#N/A"},{"$error":"#N/A"},null,null,null,184,"","",null,null,null,null,{"$error":"#N/A"},{"$error":"#N/A"},null,null,null,null,null,null,null,null,null,null,null,null,null,"Y Lightness",null,{"$error":"#N/A"},{"$error":"#N/A"}]
["Y Chroma",0,"Y Chroma",0,null,185,"","",null,null,null,null,{"$error":"#N/A"},{"$error":"#N/A"},null,null,null,185,"","",null,null,null,null,{"$error":"#N/A"},{"$error":"#N/A"},null,null,null,null,null,null,null,null,null,null,null,null,null,"Y Chroma",null,{"$error":"#N/A"},{"$error":"#N/A"}]
["Y Hue",-2,"Y Hue",0,null,186,"","",null,null,null,null,{"$error":"#N/A"},{"$error":"#N/A"},null,null,null,186,"","",null,null,null,null,{"$error":"#N/A"},{"$error":"#N/A"},null,null,null,null,null,null,null,null,null,null,null,null,null,"Y Hue",null,{"$error":"#N/A"},{"$error":"#N/A"}]
["Y/G Lightness",0,"Y/G Lightness",0,null,187,"","",null,null,null,null,{"$error":"#N/A"},{"$error":"#N/A"},null,null,null,187,"","",null,null,null,null,{"$error":"#N/A"},{"$error":"#N/A"},null,null,null,null,null,null,null,null,null,null,null,null,null,"Y/G Lightness",null,{"$error":"#N/A"},{"$error":"#N/A"}]
["Y/G Chroma",0,"Y/G Chroma",0,null,188,"","",null,null,null,null,{"$error":"#N/A"},{"$error":"#N/A"},null,null,null,188,"","",null,null,null,null,{"$error":"#N/A"},{"$error":"#N/A"},null,null,null,null,null,null,null,null,null,null,null,null,null,"Y/G Chroma",null,{"$error":"#N/A"},{"$error":"#N/A"}]
["Y/G Hue",0,"Y/G Hue",0,null,189,"","",null,null,null,null,{"$error":"#N/A"},{"$error":"#N/A"},null,null,null,189,"","",null,null,null,null,{"$error":"#N/A"},{"$error":"#N/A"},null,null,null,null,null,null,null,null,null,null,null,null,null,"Y/G Hue",null,{"$error":"#N/A"},{"$error":"#N/A"}]
["G Lightness",0,"G Lightness",0,null,190,"","",null,null,null,null,{"$error":"#N/A"},{"$error":"#N/A"},null,null,null,190,"","",null,null,null,null,{"$error":"#N/A"},{"$error":"#N/A"},null,null,null,null,null,null,null,null,null,null,null,null,null,"G Lightness",null,{"$error":"#N/A"},{"$error":"#N/A"}]
["G Chroma",0,"G Chroma",0,null,191,"","",null,null,null,null,{"$error":"#N/A"},{"$error":"#N/A"},null,null,null,191,"","",null,null,null,null,{"$error":"#N/A"},{"$error":"#N/A"},null,null,null,null,null,null,null,null,null,null,null,null,null,"G Chroma",null,{"$error":"#N/A"},{"$error":"#N/A"}]
["G Hue",1,"G Hue",0,null,192,"","",null,null,null,null,{"$error":"#N/A"},{"$error":"#N/A"},null,null,null,192,"","",null,null,null,null,{"$error":"#N/A"},{"$error":"#N/A"},null,null,null,null,null,null,null,null,null,null,null,null,null,"G Hue",null,{"$error":"#N/A"},{"$error":"#N/A"}]
["G/C Lightness",0,"G/C Lightness",0,null,193,"","",null,null,null,null,{"$error":"#N/A"},{"$error":"#N/A"},null,null,null,193,"","",null,null,null,null,{"$error":"#N/A"},{"$error":"#N/A"},null,null,null,null,null,null,null,null,null,null,null,null,null,"G/C Lightness",null,{"$error":"#N/A"},{"$error":"#N/A"}]
["G/C Chroma",0,"G/C Chroma",0,null,194,"","",null,null,null,null,{"$f":"IF(G194=\"\",NA(),ROUND(G194,0))","v":{"$error":"#N/A"}},{"$f":"IF(H194=\"\",NA(),H194)","v":{"$error":"#N/A"}},null,null,null,194,"","",null,null,null,null,{"$error":"#N/A"},{"$error":"#N/A"},null,null,null,null,null,null,null,null,null,null,null,null,null,"G/C Chroma",null,{"$f":"IF(G194=\"\",NA(),G194)","v":{"$error":"#N/A"}},{"$f":"IF(AP194=\"\",NA(),H194*AP194*0.00836/1000)","v":{"$error":"#N/A"}}]
["G/C Hue",1,"G/C Hue",0,null,{"$f":"F194+1","v":195},"","",null,null,null,null,{"$error":"#N/A"},{"$error":"#N/A"},null,null,null,{"$f":"R194+1","v":195},"","",null,null,null,null,{"$error":"#N/A"},{"$error":"#N/A"},null,null,null,null,null,null,null,null,null,null,null,null,null,"G/C Hue",null,{"$error":"#N/A"},{"$error":"#N/A"}]
["C Lightness",0,"C Lightness",0,null,196,"","",null,null,null,null,{"$error":"#N/A"},{"$error":"#N/A"},null,null,null,196,"","",null,null,null,null,{"$error":"#N/A"},{"$error":"#N/A"},null,null,null,null,null,null,null,null,null,null,null,null,null,"C Lightness",null,{"$error":"#N/A"},{"$error":"#N/A"}]
["C Chroma",0,"C Chroma",0,null,197,"","",null,null,null,null,{"$error":"#N/A"},{"$error":"#N/A"},null,null,null,197,"","",null,null,null,null,{"$error":"#N/A"},{"$error":"#N/A"},null,null,null,null,null,null,null,null,null,null,null,null,null,"C Chroma",null,{"$error":"#N/A"},{"$error":"#N/A"}]
["C Hue",1,"C Hue",0,null,198,{"$f":"IF(G197=\"\",\"\",IF(INDEX($A$1:$A$500,MATCH(\"Spe*\",$A$1:$A$500,0)+F198)=0,\"\",INDEX($A$1:$A$500,MATCH(\"Spe*\",$A$1:$A$500,0)+F198)))","v":""},{"$f":"IF(H197=\"\",\"\",IF(INDEX($A$1:$A$500,MATCH(\"Spe*\",$A$1:$A$500,0)+F198)=0,\"\",INDEX($B$1:$B$500,MATCH(\"Spe*\",$A$1:$A$500,0)+F198)))","v":""},null,null,null,null,{"$error":"#N/A"},{"$error":"#N/A"},null,null,null,198,{"$f":"IF(S197=\"\",\"\",IF(INDEX($C$1:$C$500,MATCH(\"Spe*\",$C$1:$C$500,0)+R198)=0,\"\",INDEX($C$1:$C$500,MATCH(\"Spe*\",$C$1:$C$500,0)+R198)))","v":""},{"$f":"IF(T197=\"\",\"\",IF(INDEX($C$1:$C$500,MATCH(\"Spe*\",$C$1:$C$500,0)+R198)=0,\"\",INDEX($D$1:$D$500,MATCH(\"Spe*\",$C$1:$C$500,0)+R198)))","v":""},null,null,null,null,{"$error":"#N/A"},{"$error":"#N/A"},null,null,null,null,null,null,null,null,null,null,null,null,null,"C Hue",null,{"$error":"#N/A"},{"$error":"#N/A"}]
["C/B Lightness",1,"C/B Lightness",0,null,199,"","",null,null,null,null,{"$error":"#N/A"},{"$error":"#N/A"},null,null,null,199,"","",null,null,null,null,{"$error":"#N/A"},{"$error":"#N/A"},null,null,null,null,null,null,null,null,null,null,null,null,null,"C/B Lightness",null,{"$error":"#N/A"},{"$error":"#N/A"}]
["C/B Chroma",0,"C/B Chroma",0,null,200,"","",null,null,null,null,{"$error":"#N/A"},{"$error":"#N/A"},null,null,null,200,"","",null,null,null,null,{"$error":"#N/A"},{"$error":"#N/A"},null,null,null,null,null,null,null,null,null,null,null,null,null,"C/B Chroma",null,{"$error":"#N/A"},{"$error":"#N/A"}]
["C/B Hue",-2,"C/B Hue",0,null,201,"","",null,null,null,null,{"$error":"#N/A"},{"$error":"#N/A"},null,null,null,201,"","",null,null,null,null,{"$error":"#N/A"},{"$error":"#N/A"},null,null,null,null,null,null,null,null,null,null,null,null,null,"C/B Hue",null,{"$error":"#N/A"},{"$error":"#N/A"}]
["B Lightness",0,"B Lightness",0,null,202,"","",null,null,null,null,{"$error":"#N/A"},{"$error":"#N/A"},null,null,null,202,"","",null,null,null,null,{"$error":"#N/A"},{"$error":"#N/A"},null,null,null,null,null,null,null,null,null,null,null,null,null,"B Lightness",null,{"$error":"#N/A"},{"$error":"#N/A"}]
["B Chroma",-1,"B Chroma",0,null,203,"","",null,null,null,null,{"$error":"#N/A"},{"$error":"#N/A"},null,null,null,203,"","",null,null,null,null,{"$error":"#N/A"},{"$error":"#N/A"},null,null,null,null,null,null,null,null,null,null,null,null,null,"B Chroma",null,{"$error":"#N/A"},{"$error":"#N/A"}]
["B Hue",-1,"B Hue",0,null,204,"","",null,null,null,null,{"$error":"#N/A"},{"$error":"#N/A"},null,null,null,204,"","",null,null,null,null,{"$error":"#N/A"},{"$error":"#N/A"},null,null,null,null,null,null,null,null,null,null,null,null,null,"B Hue",null,{"$error":"#N/A"},{"$error":"#N/A"}]
["B/M Lightness",1,"B/M Lightness",0,null,205,"","",null,null,null,null,{"$error":"#N/A"},{"$error":"#N/A"},null,null,null,205,"","",null,null,null,null,{"$error":"#N/A"},{"$error":"#N/A"},null,null,null,null,null,null,null,null,null,null,null,null,null,"B/M Lightness",null,{"$error":"#N/A"},{"$error":"#N/A"}]
["B/M Chroma",0,"B/M Chroma",0,null,206,"","",null,null,null,null,{"$error":"#N/A"},{"$error":"#N/A"},null,null,null,206,"","",null,null,null,null,{"$error":"#N/A"},{"$error":"#N/A"},null,null,null,null,null,null,null,null,null,null,null,null,null,"B/M Chroma",null,{"$error":"#N/A"},{"$error":"#N/A"}]
["B/M Hue",3,"B/M Hue",0,null,207,"","",null,null,null,null,{"$error":"#N/A"},{"$error":"#N/A"},null,null,null,207,"","",null,null,null,null,{"$error":"#N/A"},{"$error":"#N/A"},null,null,null,null,null,null,null,null,null,null,null,null,null,"B/M Hue",null,{"$error":"#N/A"},{"$error":"#N/A"}]
["M Lightness",1,"M Lightness",0,null,208,"","",null,null,null,null,{"$error":"#N/A"},{"$error":"#N/A"},null,null,null,208,"","",null,null,null,null,{"$error":"#N/A"},{"$error":"#N/A"},null,null,null,null,null,null,null,null,null,null,null,null,null,"M Lightness",null,{"$error":"#N/A"},{"$error":"#N/A"}]
["M Chroma",0,"M Chroma",0,null,209,"","",null,null,null,null,{"$error":"#N/A"},{"$error":"#N/A"},null,null,null,209,"","",null,null,null,null,{"$error":"#N/A"},{"$error":"#N/A"},null,null,null,null,null,null,null,null,null,null,null,null,null,"M Chroma",null,{"$error":"#N/A"},{"$error":"#N/A"}]
["M Hue",3,"M Hue",0,null,210,"","",null,null,null,null,{"$error":"#N/A"},{"$error":"#N/A"},null,null,null,210,"","",null,null,null,null,{"$error":"#N/A"},{"$error":"#N/A"},null,null,null,null,null,null,null,null,null,null,null,null,null,"M Hue",null,{"$error":"#N/A"},{"$error":"#N/A"}]
["M/R Lightness",4,"M/R Lightness",0,null,211,"","",null,null,null,null,{"$error":"#N/A"},{"$error":"#N/A"},null,null,null,211,"","",null,null,null,null,{"$error":"#N/A"},{"$error":"#N/A"},null,null,null,null,null,null,null,null,null,null,null,null,null,"M/R Lightness",null,{"$error":"#N/A"},{"$error":"#N/A"}]
["M/R Chroma",1,"M/R Chroma",0,null,212,"","",null,null,null,null,{"$error":"#N/A"},{"$error":"#N/A"},null,null,null,212,"","",null,null,null,null,{"$error":"#N/A"},{"$error":"#N/A"},null,null,null,null,null,null,null,null,null,null,null,null,null,"M/R Chroma",null,{"$error":"#N/A"},{"$error":"#N/A"}]
["M/R Hue",4,"M/R Hue",0,null,213,"","",null,null,null,null,{"$error":"#N/A"},{"$error":"#N/A"},null,null,null,213,"","",null,null,null,null,{"$error":"#N/A"},{"$error":"#N/A"},null,null,null,null,null,null,null,null,null,null,null,null,null,"M/R Hue",null,{"$error":"#N/A"},{"$error":"#N/A"}]
["Lambda Peak [nm]",595,"Lambda Peak [nm]",535,null,214,"","",null,null,null,null,{"$error":"#N/A"},{"$error":"#N/A"},null,null,null,214,"","",null,null,null,null,{"$error":"#N/A"},{"$error":"#N/A"},null,null,null,null,null,null,null,null,null,null,null,null,null,"Lambda Peak [nm]",null,{"$error":"#N/A"},{"$error":"#N/A"}]
["Lambda Peak",53.945639999999997,"Lambda Peak",35.701599999999999,null,215,"","",null,null,null,null,{"$error":"#N/A"},{"$error":"#N/A"},null,null,null,215,"","",null,null,null,null,{"$error":"#N/A"},{"$error":"#N/A"},null,null,null,null,null,null,null,null,null,null,null,null,null,"Lambda Peak",null,{"$error":"#N/A"},{"$error":"#N/A"}]
["Farbreinheit [%]",29.9,"Farbreinheit [%]",12,null,216,"","",null,null,null,null,{"$error":"#N/A"},{"$error":"#N/A"},null,null,null,216,"","",null,null,null,null,{"$error":"#N/A"},{"$error":"#N/A"},null,null,null,null,null,null,null,null,null,null,null,null,null,"Farbreinheit [%]",null,{"$error":"#N/A"},{"$error":"#N/A"}]
["Dominante Wellenlänge [nm]",577,"Dominante Wellenlänge [nm]",565,null,217,"","",null,null,null,null,{"$error":"#N/A"},{"$error":"#N/A"},null,null,null,217,"","",null,null,null,null,{"$error":"#N/A"},{"$error":"#N/A"},null,null,null,null,null,null,null,null,null,null,null,null,null,"Dominante Wellenlänge [nm]",null,{"$error":"#N/A"},{"$error":"#N/A"}]
[null,null,null,null,null,218,"","",null,null,null,null,{"$error":"#N/A"},{"$error":"#N/A"},null,null,null,218,"","",null,null,null,null,{"$error":"#N/A"},{"$error":"#N/A"},null,null,null,null,null,null,null,null,null,null,null,null,null,null,null,{"$error":"#N/A"},{"$error":"#N/A"}]
["Auflösung","5 nm","Auflösung","5 nm",null,219,"","",null,null,null,null,{"$error":"#N/A"},{"$error":"#N/A"},null,null,null,219,"","",null,null,null,null,{"$error":"#N/A"},{"$error":"#N/A"},null,null,null,null,null,null,null,null,null,null,null,null,null,"Auflösung",null,{"$error":"#N/A"},{"$error":"#N/A"}]
["Spektrum in [nm]","mW/m²/nm","Spektrum in [nm]","mW/m²/nm",null,220,"","",null,null,null,null,{"$error":"#N/A"},{"$error":"#N/A"},null,null,null,220,"","",null,null,null,null,{"$error":"#N/A"},{"$error":"#N/A"},null,null,null,null,null,null,null,null,null,null,null,null,null,"Spektrum in [nm]",null,{"$error":"#N/A"},{"$error":"#N/A"}]
[380,0.68384,380,4.8683699999999996,null,221,"","",null,null,null,null,{"$error":"#N/A"},{"$error":"#N/A"},null,null,null,221,"","",null,null,null,null,{"$error":"#N/A"},{"$error":"#N/A"},null,null,null,null,null,null,null,null,null,null,null,null,null,380,null,{"$error":"#N/A"},{"$error":"#N/A"}]
[385,0.74607000000000001,385,5.4699600000000004,null,222,"","",null,null,null,null,{"$error":"#N/A"},{"$error":"#N/A"},null,null,null,222,"","",null,null,null,null,{"$error":"#N/A"},{"$error":"#N/A"},null,null,null,null,null,null,null,null,null,null,null,null,null,385,null,{"$error":"#N/A"},{"$error":"#N/A"}]
[390,0.91386999999999996,390,6.4230700000000001,null,223,"","",null,null,null,null,{"$error":"#N/A"},{"$error":"#N/A"},null,null,null,223,"","",null,null,null,null,{"$error":"#N/A"},{"$error":"#N/A"},null,null,null,null,null,null,null,null,null,null,null,null,null,390,null,{"$error":"#N/A"},{"$error":"#N/A"}]
[395,1.2555099999999999,395,7.85189,null,224,"","",null,null,null,null,{"$error":"#N/A"},{"$error":"#N/A"},null,null,null,224,"","",null,null,null,null,{"$error":"#N/A"},{"$error":"#N/A"},null,null,null,null,null,null,null,null,null,null,null,null,null,395,null,{"$error":"#N/A"},{"$error":"#N/A"}]
[400,1.8004599999999999,400,11.00745,null,225,"","",null,null,null,null,{"$error":"#N/A"},{"$error":"#N/A"},null,null,null,225,"","",null,null,null,null,{"$error":"#N/A"},{"$error":"#N/A"},null,null,null,null,null,null,null,null,null,null,null,null,null,400,null,{"$error":"#N/A"},{"$error":"#N/A"}]
[405,2.1574399999999998,405,14.09629,null,226,"","",null,null,null,null,{"$error":"#N/A"},{"$error":"#N/A"},null,null,null,226,"","",null,null,null,null,{"$f":"IF(S226=\"\",NA(),ROUND(S226,0))","v":{"$error":"#N/A"}},{"$f":"IF(T226=\"\",NA(),T226)","v":{"$error":"#N/A"}},null,null,null,null,null,null,null,null,null,null,null,null,null,405,null,{"$error":"#N/A"},{"$error":"#N/A"}]
[410,2.7395700000000001,410,15.79012,null,227,"","",null,null,null,null,{"$error":"#N/A"},{"$error":"#N/A"},null,null,null,227,"","",null,null,null,null,{"$error":"#N/A"},{"$error":"#N/A"},null,null,null,null,null,null,null,null,null,null,null,null,null,410,null,{"$error":"#N/A"},{"$error":"#N/A"}]
[415,3.6223900000000002,415,17.87473,null,228,"","",null,null,null,null,{"$error":"#N/A"},{"$error":"#N/A"},null,null,null,228,"","",null,null,null,null,{"$error":"#N/A"},{"$error":"#N/A"},null,null,null,null,null,null,null,null,null,null,null,null,null,415,null,{"$error":"#N/A"},{"$error":"#N/A"}]
[420,4.6374399999999998,420,18.96669,null,229,"","",null,null,null,null,{"$error":"#N/A"},{"$error":"#N/A"},null,null,null,229,"","",null,null,null,null,{"$error":"#N/A"},{"$error":"#N/A"},null,null,null,null,null,null,null,null,null,null,null,null,null,420,null,{"$error":"#N/A"},{"$error":"#N/A"}]
[425,6.1680599999999997,425,19.204049999999999,null,230,"","",null,null,null,null,{"$error":"#N/A"},{"$error":"#N/A"},null,null,null,230,"","",null,null,null,null,{"$error":"#N/A"},{"$error":"#N/A"},null,null,null,null,null,null,null,null,null,null,null,null,null,425,null,{"$error":"#N/A"},{"$error":"#N/A"}]
[430,8.7164999999999999,430,19.38673,null,231,"","",null,null,null,null,{"$error":"#N/A"},{"$error":"#N/A"},null,null,null,231,"","",null,null,null,null,{"$error":"#N/A"},{"$error":"#N/A"},null,null,null,null,null,null,null,null,null,null,null,null,null,430,null,{"$error":"#N/A"},{"$error":"#N/A"}]
[435,13.82133,435,21.327269999999999,null,232,"","",null,null,null,null,{"$error":"#N/A"},{"$error":"#N/A"},null,null,null,232,"","",null,null,null,null,{"$error":"#N/A"},{"$error":"#N/A"},null,null,null,null,null,null,null,null,null,null,null,null,null,435,null,{"$error":"#N/A"},{"$error":"#N/A"}]
[440,23.31664,440,23.840699999999998,null,233,"","",null,null,null,null,{"$error":"#N/A"},{"$error":"#N/A"},null,null,null,233,"","",null,null,null,null,{"$error":"#N/A"},{"$error":"#N/A"},null,null,null,null,null,null,null,null,null,null,null,null,null,440,null,{"$error":"#N/A"},{"$error":"#N/A"}]
[445,38.419719999999998,445,26.222650000000002,null,234,"","",null,null,null,null,{"$error":"#N/A"},{"$error":"#N/A"},null,null,null,234,"","",null,null,null,null,{"$error":"#N/A"},{"$error":"#N/A"},null,null,null,null,null,null,null,null,null,null,null,null,null,445,null,{"$error":"#N/A"},{"$error":"#N/A"}]
[450,50.485010000000003,450,28.430029999999999,null,235,"","",null,null,null,null,{"$error":"#N/A"},{"$error":"#N/A"},null,null,null,235,"","",null,null,null,null,{"$error":"#N/A"},{"$error":"#N/A"},null,null,null,null,null,null,null,null,null,null,null,null,null,450,null,{"$error":"#N/A"},{"$error":"#N/A"}]
[455,48.125909999999998,455,29.985900000000001,null,236,"","",null,null,null,null,{"$error":"#N/A"},{"$error":"#N/A"},null,null,null,236,"","",null,null,null,null,{"$error":"#N/A"},{"$error":"#N/A"},null,null,null,null,null,null,null,null,null,null,null,null,null,455,null,{"$error":"#N/A"},{"$error":"#N/A"}]
[460,37.257539999999999,460,30.982320000000001,null,237,"","",null,null,null,null,{"$error":"#N/A"},{"$error":"#N/A"},null,null,null,237,"","",null,null,null,null,{"$error":"#N/A"},{"$error":"#N/A"},null,null,null,null,null,null,null,null,null,null,null,null,null,460,null,{"$error":"#N/A"},{"$error":"#N/A"}]
[465,29.61403,465,31.529330000000002,null,238,"","",null,null,null,null,{"$error":"#N/A"},{"$error":"#N/A"},null,null,null,238,"","",null,null,null,null,{"$error":"#N/A"},{"$error":"#N/A"},null,null,null,null,null,null,null,null,null,null,null,null,null,465,null,{"$error":"#N/A"},{"$error":"#N/A"}]
[470,24.335519999999999,470,31.893429999999999,null,239,"","",null,null,null,null,{"$error":"#N/A"},{"$error":"#N/A"},null,null,null,239,"","",null,null,null,null,{"$error":"#N/A"},{"$error":"#N/A"},null,null,null,null,null,null,null,null,null,null,null,null,null,470,null,{"$error":"#N/A"},{"$error":"#N/A"}]
[475,20.106950000000001,475,32.688589999999998,null,240,"","",null,null,null,null,{"$error":"#N/A"},{"$error":"#N/A"},null,null,null,240,"","",null,null,null,null,{"$error":"#N/A"},{"$error":"#N/A"},null,null,null,null,null,null,null,null,null,null,null,null,null,475,null,{"$error":"#N/A"},{"$error":"#N/A"}]
[480,18.811810000000001,480,33.247459999999997,null,241,"","",null,null,null,null,{"$error":"#N/A"},{"$error":"#N/A"},null,null,null,241,"","",null,null,null,null,{"$error":"#N/A"},{"$error":"#N/A"},null,null,null,null,null,null,null,null,null,null,null,null,null,480,null,{"$error":"#N/A"},{"$error":"#N/A"}]
[485,19.296890000000001,485,32.787480000000002,null,242,"","",null,null,null,null,{"$error":"#N/A"},{"$error":"#N/A"},null,null,null,242,"","",null,null,null,null,{"$error":"#N/A"},{"$error":"#N/A"},null,null,null,null,null,null,null,null,null,null,null,null,null,485,null,{"$error":"#N/A"},{"$error":"#N/A"}]
[490,21.250699999999998,490,32.907299999999999,null,243,"","",null,null,null,null,{"$error":"#N/A"},{"$error":"#N/A"},null,null,null,243,"","",null,null,null,null,{"$error":"#N/A"},{"$error":"#N/A"},null,null,null,null,null,null,null,null,null,null,null,null,null,490,null,{"$error":"#N/A"},{"$error":"#N/A"}]
[495,24.390899999999998,495,33.778849999999998,null,244,"","",null,null,null,null,{"$error":"#N/A"},{"$error":"#N/A"},null,null,null,244,"","",null,null,null,null,{"$error":"#N/A"},{"$error":"#N/A"},null,null,null,null,null,null,null,null,null,null,null,null,null,495,null,{"$error":"#N/A"},{"$error":"#N/A"}]
[500,27.90953,500,33.766120000000001,null,245,"","",null,null,null,null,{"$error":"#N/A"},{"$error":"#N/A"},null,null,null,245,"","",null,null,null,null,{"$error":"#N/A"},{"$error":"#N/A"},null,null,null,null,null,null,null,null,null,null,null,null,null,500,null,{"$error":"#N/A"},{"$error":"#N/A"}]
[505,31.271339999999999,505,33.901580000000003,null,246,"","",null,null,null,null,{"$error":"#N/A"},{"$error":"#N/A"},null,null,null,246,"","",null,null,null,null,{"$error":"#N/A"},{"$error":"#N/A"},null,null,null,null,null,null,null,null,null,null,null,null,null,505,null,{"$error":"#N/A"},{"$error":"#N/A"}]
[510,33.841369999999998,510,34.187289999999997,null,247,"","",null,null,null,null,{"$error":"#N/A"},{"$error":"#N/A"},null,null,null,247,"","",null,null,null,null,{"$error":"#N/A"},{"$error":"#N/A"},null,null,null,null,null,null,null,null,null,null,null,null,null,510,null,{"$error":"#N/A"},{"$error":"#N/A"}]
[515,35.920009999999998,515,33.825180000000003,null,248,"","",null,null,null,null,{"$error":"#N/A"},{"$error":"#N/A"},null,null,null,248,"","",null,null,null,null,{"$error":"#N/A"},{"$error":"#N/A"},null,null,null,null,null,null,null,null,null,null,null,null,null,515,null,{"$error":"#N/A"},{"$error":"#N/A"}]
[520,37.57893,520,33.896500000000003,null,249,"","",null,null,null,null,{"$error":"#N/A"},{"$error":"#N/A"},null,null,null,249,"","",null,null,null,null,{"$error":"#N/A"},{"$error":"#N/A"},null,null,null,null,null,null,null,null,null,null,null,null,null,520,null,{"$error":"#N/A"},{"$error":"#N/A"}]
[525,38.95928,525,34.675460000000001,null,250,"","",null,null,null,null,{"$error":"#N/A"},{"$error":"#N/A"},null,null,null,250,"","",null,null,null,null,{"$error":"#N/A"},{"$error":"#N/A"},null,null,null,null,null,null,null,null,null,null,null,null,null,525,null,{"$error":"#N/A"},{"$error":"#N/A"}]
[530,40.104469999999999,530,35.293309999999998,null,251,"","",null,null,null,null,{"$error":"#N/A"},{"$error":"#N/A"},null,null,null,251,"","",null,null,null,null,{"$error":"#N/A"},{"$error":"#N/A"},null,null,null,null,null,null,null,null,null,null,null,null,null,530,null,{"$error":"#N/A"},{"$error":"#N/A"}]
[535,41.304229999999997,535,35.68224,null,252,"","",null,null,null,null,{"$error":"#N/A"},{"$error":"#N/A"},null,null,null,252,"","",null,null,null,null,{"$error":"#N/A"},{"$error":"#N/A"},null,null,null,null,null,null,null,null,null,null,null,null,null,535,null,{"$error":"#N/A"},{"$error":"#N/A"}]
[540,42.239730000000002,540,35.4527,null,253,"","",null,null,null,null,{"$error":"#N/A"},{"$error":"#N/A"},null,null,null,253,"","",null,null,null,null,{"$error":"#N/A"},{"$error":"#N/A"},null,null,null,null,null,null,null,null,null,null,null,null,null,540,null,{"$error":"#N/A"},{"$error":"#N/A"}]
[545,43.382800000000003,545,35.493510000000001,null,254,"","",null,null,null,null,{"$error":"#N/A"},{"$error":"#N/A"},null,null,null,254,"","",null,null,null,null,{"$error":"#N/A"},{"$error":"#N/A"},null,null,null,null,null,null,null,null,null,null,null,null,null,545,null,{"$error":"#N/A"},{"$error":"#N/A"}]
[550,44.504919999999998,550,35.560569999999998,null,255,"","",null,null,null,null,{"$error":"#N/A"},{"$error":"#N/A"},null,null,null,255,"","",null,null,null,null,{"$error":"#N/A"},{"$error":"#N/A"},null,null,null,null,null,null,null,null,null,null,null,null,null,550,null,{"$error":"#N/A"},{"$error":"#N/A"}]
[555,45.709710000000001,555,35.349110000000003,null,256,"","",null,null,null,null,{"$error":"#N/A"},{"$error":"#N/A"},null,null,null,256,"","",null,null,null,null,{"$error":"#N/A"},{"$error":"#N/A"},null,null,null,null,null,null,null,null,null,null,null,null,null,555,null,{"$error":"#N/A"},{"$error":"#N/A"}]
[560,47.049399999999999,560,34.814500000000002,null,257,"","",null,null,null,null,{"$error":"#N/A"},{"$error":"#N/A"},null,null,null,257,"","",null,null,null,null,{"$error":"#N/A"},{"$error":"#N/A"},null,null,null,null,null,null,null,null,null,null,null,null,null,560,null,{"$error":"#N/A"},{"$error":"#N/A"}]
[565,48.187980000000003,565,34.082479999999997,null,258,"","",null,null,null,null,{"$f":"IF(G258=\"\",NA(),ROUND(G258,0))","v":{"$error":"#N/A"}},{"$f":"IF(H258=\"\",NA(),H258)","v":{"$error":"#N/A"}},null,null,null,258,"","",null,null,null,null,{"$error":"#N/A"},{"$error":"#N/A"},null,null,null,null,null,null,null,null,null,null,null,null,null,565,null,{"$f":"IF(G258=\"\",NA(),G258)","v":{"$error":"#N/A"}},{"$f":"IF(AP258=\"\",NA(),H258*AP258*0.00836/1000)","v":{"$error":"#N/A"}}]
[570,49.69511,570,33.552959999999999,null,null,null,null,null,null,null,null,null,null,null,null,null,null,null,null,null,null,null,null,null,null,null,null,null,null,null,null,null,null,null,null,null,null,null,570]
[575,51.013109999999998,575,33.209710000000001,null,null,null,null,null,null,null,null,null,null,null,null,null,null,null,null,null,null,null,null,null,null,null,null,null,null,null,null,null,null,null,null,null,null,null,575]
[580,52.255859999999998,580,33.343850000000003,null,1,{"$f":"INDEX($A$200:$A$1200,MATCH(\"t in*\",$A$200:$A$1200,0)+F261)","v":0},{"$f":"INDEX($B$200:$B$1200,MATCH(\"t in*\",$A$200:$A$1200,0)+F261)","v":2904.21},null,null,null,null,null,null,null,null,null,1,{"$f":"INDEX($C$1:$C$1200,MATCH(\"t in*\",$C$1:$C$1200,0)+R261)","v":0},{"$f":"INDEX($D$1:$D$1200,MATCH(\"t in*\",$C$1:$C$1200,0)+R261)","v":2038.559},null,null,null,null,null,null,null,null,null,null,null,null,null,null,null,null,null,null,null,580]
[585,53.208840000000002,585,32.963650000000001,null,{"$f":"F261+1","v":2},{"$f":"INDEX($A$200:$A$1200,MATCH(\"t in*\",$A$200:$A$1200,0)+F262)","v":0.125},{"$f":"INDEX($B$200:$B$1200,MATCH(\"t in*\",$A$200:$A$1200,0)+F262)","v":2904.21},null,null,null,null,null,null,null,null,null,{"$f":"R261+1","v":2},{"$f":"INDEX($C$1:$C$1200,MATCH(\"t in*\",$C$1:$C$1200,0)+R262)","v":0.125},{"$f":"INDEX($D$1:$D$1200,MATCH(\"t in*\",$C$1:$C$1200,0)+R262)","v":2024.529},null,null,null,null,null,null,null,null,null,null,null,null,null,null,null,null,null,null,null,585]
[590,53.498269999999998,590,31.826820000000001,null,{"$f":"F262+1","v":3},0.25,2884.5680000000002,null,null,null,null,null,null,null,null,null,{"$f":"R262+1","v":3},0.25,2038.559,null,null,null,null,null,null,null,null,null,null,null,null,null,null,null,null,null,null,null,590]
[595,53.85181,595,31.915839999999999,null,4,0.375,2884.5680000000002,null,null,null,null,null,null,null,null,null,4,0.375,2010.499,null,null,null,null,null,null,null,null,null,null,null,null,null,null,null,null,null,null,null,595]
[600,53.785820000000001,600,32.576860000000003,null,5,0.5,2864.9259999999999,null,null,null,null,null,null,null,null,null,5,0.5,2024.529,null,null,null,null,null,null,null,null,null,null,null,null,null,null,null,null,null,null,null,600]
[605,52.931550000000001,605,32.980910000000002,null,6,0.625,2864.9259999999999,null,null,null,null,null,null,null,null,null,6,0.625,2024.529,null,null,null,null,null,null,null,null,null,null,null,null,null,null,null,null,null,null,null,605]
[610,51.470959999999998,610,32.890790000000003,null,7,0.75,2825.6419999999998,null,null,null,null,null,null,null,null,null,7,0.75,2038.559,null,null,null,null,null,null,null,null,null,null,null,null,null,null,null,null,null,null,null,610]
[615,49.462730000000001,615,32.654049999999998,null,8,0.875,2806,null,null,null,null,null,null,null,null,null,8,0.875,2024.529,null,null,null,null,null,null,null,null,null,null,null,null,null,null,null,null,null,null,null,615]
[620,47.248339999999999,620,32.435200000000002,null,9,1,2766.7159999999999,null,null,null,null,null,null,null,null,null,9,1,2024.529,null,null,null,null,null,null,null,null,null,null,null,null,null,null,null,null,null,null,null,620]
[625,44.708779999999997,625,31.896429999999999,null,10,1.125,2727.4319999999998,null,null,null,null,null,null,null,null,null,10,1.125,2024.529,null,null,null,null,null,null,null,null,null,null,null,null,null,null,null,null,null,null,null,625]
[630,41.866079999999997,630,31.518370000000001,null,11,1.25,2709.1930000000002,null,null,null,null,null,null,null,null,null,11,1.25,2024.529,null,null,null,null,null,null,null,null,null,null,null,null,null,null,null,null,null,null,null,630]
[635,39.115130000000001,635,31.882719999999999,null,12,1.375,2654.4760000000001,null,null,null,null,null,null,null,null,null,12,1.375,2024.529,null,null,null,null,null,null,null,null,null,null,null,null,null,null,null,null,null,null,null,635]
[640,36.297190000000001,640,31.998830000000002,null,13,1.5,2636.2370000000001,null,null,null,null,null,null,null,null,null,13,1.5,2024.529,null,null,null,null,null,null,null,null,null,null,null,null,null,null,null,null,null,null,null,640]
[645,33.354109999999999,645,31.509540000000001,null,14,1.625,2598.3560000000002,null,null,null,null,null,null,null,null,null,14,1.625,2038.559,null,null,null,null,null,null,null,null,null,null,null,null,null,null,null,null,null,null,null,645]
[650,30.468530000000001,650,30.996189999999999,null,15,1.75,2581.52,null,null,null,null,null,null,null,null,null,15,1.75,2024.529,null,null,null,null,null,null,null,null,null,null,null,null,null,null,null,null,null,null,null,650]
[655,27.645689999999998,655,30.832129999999999,null,16,1.875,2526.8029999999999,null,null,null,null,null,null,null,null,null,16,1.875,2038.559,null,null,null,null,null,null,null,null,null,null,null,null,null,null,null,null,null,null,null,655]
[660,25.30733,660,31.51024,null,17,2,2509.9670000000001,null,null,null,null,null,null,null,null,null,17,2,2024.529,null,null,null,null,null,null,null,null,null,null,null,null,null,null,null,null,null,null,null,660]
[665,23.26774,665,32.262999999999998,null,18,2.125,2476.2950000000001,null,null,null,null,null,null,null,null,null,18,2.125,2024.529,null,null,null,null,null,null,null,null,null,null,null,null,null,null,null,null,null,null,null,665]
[670,21.508050000000001,670,32.3872,null,19,2.25,2459.4589999999998,null,null,null,null,null,null,null,null,null,19,2.25,2024.529,null,null,null,null,null,null,null,null,null,null,null,null,null,null,null,null,null,null,null,670]
[675,19.688700000000001,675,32.215690000000002,null,20,2.375,2425.7869999999998,null,null,null,null,null,null,null,null,null,20,2.375,2038.559,null,null,null,null,null,null,null,null,null,null,null,null,null,null,null,null,null,null,null,675]
[680,17.91291,680,31.39199,null,21,2.5,2393.518,null,null,null,null,null,null,null,null,null,21,2.5,2024.529,null,null,null,null,null,null,null,null,null,null,null,null,null,null,null,null,null,null,null,680]
[685,16.05528,685,29.203489999999999,null,{"$f":"F281+1","v":22},2.625,2358.4430000000002,null,null,null,null,null,null,null,null,null,22,2.625,2038.559,null,null,null,null,null,null,null,null,null,null,null,null,null,null,null,null,null,null,null,685]
[690,14.52068,690,27.984940000000002,null,23,2.75,2327.5770000000002,null,null,null,null,null,null,null,null,null,23,2.75,2024.529,null,null,null,null,null,null,null,null,null,null,null,null,null,null,null,null,null,null,null,690]
[695,13.57545,695,28.82901,null,24,2.875,2295.308,null,null,null,null,null,null,null,null,null,24,2.875,2010.499,null,null,null,null,null,null,null,null,null,null,null,null,null,null,null,null,null,null,null,695]
[700,13.04884,700,29.97842,null,25,3,2263.0390000000002,null,null,null,null,null,null,null,null,null,25,3,2038.559,null,null,null,null,null,null,null,null,null,null,null,null,null,null,null,null,null,null,null,700]
[705,12.820119999999999,705,30.925750000000001,null,26,3.125,2247.6060000000002,null,null,null,null,null,null,null,null,null,26,3.125,2010.499,null,null,null,null,null,null,null,null,null,null,null,null,null,null,null,null,null,null,null,705]
[710,12.3506,710,31.020679999999999,null,27,3.25,2215.337,null,null,null,null,null,null,null,null,null,27,3.25,2024.529,null,null,null,null,null,null,null,null,null,null,null,null,null,null,null,null,null,null,null,710]
[715,11.118410000000001,715,28.489100000000001,null,28,3.375,2185.8739999999998,null,null,null,null,null,null,null,null,null,28,3.375,2024.529,null,null,null,null,null,null,null,null,null,null,null,null,null,null,null,null,null,null,null,715]
[720,10.232659999999999,720,25.99418,null,29,3.5,2156.4110000000001,null,null,null,null,null,null,null,null,null,29,3.5,2038.559,null,null,null,null,null,null,null,null,null,null,null,null,null,null,null,null,null,null,null,720]
[725,9.8008000000000006,725,26.140440000000002,null,30,3.625,2140.9780000000001,null,null,null,null,null,null,null,null,null,30,3.625,2024.529,null,null,null,null,null,null,null,null,null,null,null,null,null,null,null,null,null,null,null,725]
[730,10.161989999999999,730,28.3384,null,31,3.75,2110.1120000000001,null,null,null,null,null,null,null,null,null,31,3.75,2024.529,null,null,null,null,null,null,null,null,null,null,null,null,null,null,null,null,null,null,null,730]
[735,10.65001,735,31.436419999999998,null,32,3.875,2110.1120000000001,null,null,null,null,null,null,null,null,null,32,3.875,2024.529,null,null,null,null,null,null,null,null,null,null,null,null,null,null,null,null,null,null,null,735]
[740,11.0448,740,33.732039999999998,null,33,4,2096.0819999999999,null,null,null,null,null,null,null,null,null,33,4,2038.559,null,null,null,null,null,null,null,null,null,null,null,null,null,null,null,null,null,null,null,740]
[745,11.26281,745,34.829740000000001,null,34,4.125,2082.0520000000001,null,null,null,null,null,null,null,null,null,34,4.125,2024.529,null,null,null,null,null,null,null,null,null,null,null,null,null,null,null,null,null,null,null,745]
[750,11.173349999999999,750,34.294469999999997,null,35,4.25,2082.0520000000001,null,null,null,null,null,null,null,null,null,35,4.25,2024.529,null,null,null,null,null,null,null,null,null,null,null,null,null,null,null,null,null,null,null,750]
[755,9.8014100000000006,755,29.90155,null,36,4.375,2066.6190000000001,null,null,null,null,null,null,null,null,null,36,4.375,2024.529,null,null,null,null,null,null,null,null,null,null,null,null,null,null,null,null,null,null,null,755]
[760,7.5748499999999996,760,23.06175,null,37,4.5,2082.0520000000001,null,null,null,null,null,null,null,null,null,37,4.5,2024.529,null,null,null,null,null,null,null,null,null,null,null,null,null,null,null,null,null,null,null,760]
[765,7.42204,765,23.77815,null,38,4.625,2082.0520000000001,null,null,null,null,null,null,null,null,null,38,4.625,2038.559,null,null,null,null,null,null,null,null,null,null,null,null,null,null,null,null,null,null,null,765]
[770,9.3577700000000004,770,30.256830000000001,null,39,4.75,2082.0520000000001,null,null,null,null,null,null,null,null,null,39,4.75,2024.529,null,null,null,null,null,null,null,null,null,null,null,null,null,null,null,null,null,null,null,770]
[775,10.22785,775,33.228470000000002,null,40,4.875,2110.1120000000001,null,null,null,null,null,null,null,null,null,40,4.875,2024.529,null,null,null,null,null,null,null,null,null,null,null,null,null,null,null,null,null,null,null,775]
[780,10.4739,780,33.250079999999997,null,41,5,2126.9479999999999,null,null,null,null,null,null,null,null,null,41,5,2024.529,null,null,null,null,null,null,null,null,null,null,null,null,null,null,null,null,null,null,null,780]
[null,null,null,null,null,42,5.125,2140.9780000000001,null,null,null,null,null,null,null,null,null,42,5.125,2024.529]
["Flickerverlauf",null,"Flickerverlauf",null,null,43,5.25,2156.4110000000001,null,null,null,null,null,null,null,null,null,43,5.25,2024.529,null,null,null,null,null,null,null,null,null,null,null,null,null,null,null,null,null,null,null,"Flickerverlauf"]
["t in [ms]","E in [lx]","t in [ms]","E in [lx]",null,44,5.375,2170.4409999999998,null,null,null,null,null,null,null,null,null,44,5.375,2010.499,null,null,null,null,null,null,null,null,null,null,null,null,null,null,null,null,null,null,null,"t in [ms]"]
[0,2904.21,0,2038.559,null,45,5.5,2201.3069999999998,null,null,null,null,null,null,null,null,null,45,5.5,2024.529,null,null,null,null,null,null,null,null,null,null,null,null,null,null,null,null,null,null,null,0]
[0.125,2904.21,0.125,2024.529,null,46,5.625,2215.337,null,null,null,null,null,null,null,null,null,46,5.625,2038.559,null,null,null,null,null,null,null,null,null,null,null,null,null,null,null,null,null,null,null,0.125]
[0.25,2884.5680000000002,0.25,2038.559,null,47,5.75,2247.6060000000002,null,null,null,null,null,null,null,null,null,47,5.75,2024.529,null,null,null,null,null,null,null,null,null,null,null,null,null,null,null,null,null,null,null,0.25]
[0.375,2884.5680000000002,0.375,2010.499,null,48,5.875,2263.0390000000002,null,null,null,null,null,null,null,null,null,48,5.875,2024.529,null,null,null,null,null,null,null,null,null,null,null,null,null,null,null,null,null,null,null,0.375]
[0.5,2864.9259999999999,0.5,2024.529,null,49,6,2279.875,null,null,null,null,null,null,null,null,null,49,6,2024.529,null,null,null,null,null,null,null,null,null,null,null,null,null,null,null,null,null,null,null,0.5]
[0.625,2864.9259999999999,0.625,2024.529,null,50,6.125,2327.5770000000002,null,null,null,null,null,null,null,null,null,50,6.125,2024.529,null,null,null,null,null,null,null,null,null,null,null,null,null,null,null,null,null,null,null,0.625]
[0.75,2825.6419999999998,0.75,2038.559,null,51,6.25,2343.0100000000002,null,null,null,null,null,null,null,null,null,51,6.25,2038.559,null,null,null,null,null,null,null,null,null,null,null,null,null,null,null,null,null,null,null,0.75]
[0.875,2806,0.875,2024.529,null,52,6.375,2375.279,null,null,null,null,null,null,null,null,null,52,6.375,2010.499,null,null,null,null,null,null,null,null,null,null,null,null,null,null,null,null,null,null,null,0.875]
[1,2766.7159999999999,1,2024.529,null,53,6.5,2408.951,null,null,null,null,null,null,null,null,null,53,6.5,2024.529,null,null,null,null,null,null,null,null,null,null,null,null,null,null,null,null,null,null,null,1]
[1.125,2727.4319999999998,1.125,2024.529,null,54,6.625,2442.623,null,null,null,null,null,null,null,null,null,54,6.625,2024.529,null,null,null,null,null,null,null,null,null,null,null,null,null,null,null,null,null,null,null,1.125]
[1.25,2709.1930000000002,1.25,2024.529,null,55,6.75,2476.2950000000001,null,null,null,null,null,null,null,null,null,55,6.75,2038.559,null,null,null,null,null,null,null,null,null,null,null,null,null,null,null,null,null,null,null,1.25]
[1.375,2654.4760000000001,1.375,2024.529,null,56,6.875,2493.1309999999999,null,null,null,null,null,null,null,null,null,56,6.875,2024.529,null,null,null,null,null,null,null,null,null,null,null,null,null,null,null,null,null,null,null,1.375]
[1.5,2636.2370000000001,1.5,2024.529,null,57,7,2509.9670000000001,null,null,null,null,null,null,null,null,null,57,7,2010.499,null,null,null,null,null,null,null,null,null,null,null,null,null,null,null,null,null,null,null,1.5]
[1.625,2598.3560000000002,1.625,2038.559,null,58,7.125,2545.0419999999999,null,null,null,null,null,null,null,null,null,58,7.125,2024.529,null,null,null,null,null,null,null,null,null,null,null,null,null,null,null,null,null,null,null,1.625]
[1.75,2581.52,1.75,2024.529,null,59,7.25,2581.52,null,null,null,null,null,null,null,null,null,59,7.25,2024.529,null,null,null,null,null,null,null,null,null,null,null,null,null,null,null,null,null,null,null,1.75]
[1.875,2526.8029999999999,1.875,2038.559,null,60,7.375,2598.3560000000002,null,null,null,null,null,null,null,null,null,60,7.375,2024.529,null,null,null,null,null,null,null,null,null,null,null,null,null,null,null,null,null,null,null,1.875]
[2,2509.9670000000001,2,2024.529,null,61,7.5,2636.2370000000001,null,null,null,null,null,null,null,null,null,61,7.5,2010.499,null,null,null,null,null,null,null,null,null,null,null,null,null,null,null,null,null,null,null,2]
[2.125,2476.2950000000001,2.125,2024.529,null,62,7.625,2654.4760000000001,null,null,null,null,null,null,null,null,null,62,7.625,2024.529,null,null,null,null,null,null,null,null,null,null,null,null,null,null,null,null,null,null,null,2.125]
[2.25,2459.4589999999998,2.25,2024.529,null,63,7.75,2690.9540000000002,null,null,null,null,null,null,null,null,null,63,7.75,2010.499,null,null,null,null,null,null,null,null,null,null,null,null,null,null,null,null,null,null,null,2.25]
[2.375,2425.7869999999998,2.375,2038.559,null,64,7.875,2709.1930000000002,null,null,null,null,null,null,null,null,null,64,7.875,2038.559,null,null,null,null,null,null,null,null,null,null,null,null,null,null,null,null,null,null,null,2.375]
[2.5,2393.518,2.5,2024.529,null,65,8,2727.4319999999998,null,null,null,null,null,null,null,null,null,65,8,2024.529,null,null,null,null,null,null,null,null,null,null,null,null,null,null,null,null,null,null,null,2.5]
[2.625,2358.4430000000002,2.625,2038.559,null,66,{"$f":"INDEX($A$200:$A$1200,MATCH(\"t in*\",$A$200:$A$1200,0)+F326)","v":8.125},{"$f":"INDEX($B$200:$B$1200,MATCH(\"t in*\",$A$200:$A$1200,0)+F326)","v":2748.4769999999999},null,null,null,null,null,null,null,null,null,66,{"$f":"INDEX($C$1:$C$1200,MATCH(\"t in*\",$C$1:$C$1200,0)+R326)","v":8.125},{"$f":"INDEX($D$1:$D$1200,MATCH(\"t in*\",$C$1:$C$1200,0)+R326)","v":2024.529},null,null,null,null,null,null,null,null,null,null,null,null,null,null,null,null,null,null,null,2.625]
[2.75,2327.5770000000002,2.75,2024.529,null,67,8.25,2784.9549999999999,null,null,null,null,null,null,null,null,null,{"$f":"R326+1","v":67},8.25,2024.529,null,null,null,null,null,null,null,null,null,null,null,null,null,null,null,null,null,null,null,2.75]
[2.875,2295.308,2.875,2010.499,null,68,8.375,2806,null,null,null,null,null,null,null,null,null,68,8.375,2010.499,null,null,null,null,null,null,null,null,null,null,null,null,null,null,null,null,null,null,null,2.875]
[3,2263.0390000000002,3,2038.559,null,69,8.5,2825.6419999999998,null,null,null,null,null,null,null,null,null,69,8.5,2024.529,null,null,null,null,null,null,null,null,null,null,null,null,null,null,null,null,null,null,null,3]
[3.125,2247.6060000000002,3.125,2010.499,null,70,8.625,2825.6419999999998,null,null,null,null,null,null,null,null,null,70,8.625,2010.499,null,null,null,null,null,null,null,null,null,null,null,null,null,null,null,null,null,null,null,3.125]
[3.25,2215.337,3.25,2024.529,null,71,8.75,2864.9259999999999,null,null,null,null,null,null,null,null,null,71,8.75,2010.499,null,null,null,null,null,null,null,null,null,null,null,null,null,null,null,null,null,null,null,3.25]
[3.375,2185.8739999999998,3.375,2024.529,null,72,8.875,2884.5680000000002,null,null,null,null,null,null,null,null,null,72,8.875,2010.499,null,null,null,null,null,null,null,null,null,null,null,null,null,null,null,null,null,null,null,3.375]
[3.5,2156.4110000000001,3.5,2038.559,null,73,9,2864.9259999999999,null,null,null,null,null,null,null,null,null,73,9,2038.559,null,null,null,null,null,null,null,null,null,null,null,null,null,null,null,null,null,null,null,3.5]
[3.625,2140.9780000000001,3.625,2024.529,null,74,9.125,2884.5680000000002,null,null,null,null,null,null,null,null,null,74,9.125,2024.529,null,null,null,null,null,null,null,null,null,null,null,null,null,null,null,null,null,null,null,3.625]
[3.75,2110.1120000000001,3.75,2024.529,null,75,9.25,2904.21,null,null,null,null,null,null,null,null,null,75,9.25,2024.529,null,null,null,null,null,null,null,null,null,null,null,null,null,null,null,null,null,null,null,3.75]
[3.875,2110.1120000000001,3.875,2024.529,null,76,9.375,2923.8519999999999,null,null,null,null,null,null,null,null,null,76,9.375,2024.529,null,null,null,null,null,null,null,null,null,null,null,null,null,null,null,null,null,null,null,3.875]
[4,2096.0819999999999,4,2038.559,null,77,9.5,2923.8519999999999,null,null,null,null,null,null,null,null,null,77,9.5,2024.529,null,null,null,null,null,null,null,null,null,null,null,null,null,null,null,null,null,null,null,4]
[4.125,2082.0520000000001,4.125,2024.529,null,78,9.625,2923.8519999999999,null,null,null,null,null,null,null,null,null,78,9.625,2024.529,null,null,null,null,null,null,null,null,null,null,null,null,null,null,null,null,null,null,null,4.125]
[4.25,2082.0520000000001,4.25,2024.529,null,79,9.75,2904.21,null,null,null,null,null,null,null,null,null,79,9.75,2010.499,null,null,null,null,null,null,null,null,null,null,null,null,null,null,null,null,null,null,null,4.25]
[4.375,2066.6190000000001,4.375,2024.529,null,80,9.875,2923.8519999999999,null,null,null,null,null,null,null,null,null,80,9.875,2024.529,null,null,null,null,null,null,null,null,null,null,null,null,null,null,null,null,null,null,null,4.375]
[4.5,2082.0520000000001,4.5,2024.529,null,81,10,2904.21,null,null,null,null,null,null,null,null,null,81,10,2010.499,null,null,null,null,null,null,null,null,null,null,null,null,null,null,null,null,null,null,null,4.5]
[4.625,2082.0520000000001,4.625,2038.559,null,82,10.125,2904.21,null,null,null,null,null,null,null,null,null,82,10.125,2024.529,null,null,null,null,null,null,null,null,null,null,null,null,null,null,null,null,null,null,null,4.625]
[4.75,2082.0520000000001,4.75,2024.529,null,83,10.25,2884.5680000000002,null,null,null,null,null,null,null,null,null,83,10.25,2024.529,null,null,null,null,null,null,null,null,null,null,null,null,null,null,null,null,null,null,null,4.75]
[4.875,2110.1120000000001,4.875,2024.529,null,84,10.375,2884.5680000000002,null,null,null,null,null,null,null,null,null,84,10.375,2024.529,null,null,null,null,null,null,null,null,null,null,null,null,null,null,null,null,null,null,null,4.875]
[5,2126.9479999999999,5,2024.529,null,85,10.5,2864.9259999999999,null,null,null,null,null,null,null,null,null,85,10.5,2024.529,null,null,null,null,null,null,null,null,null,null,null,null,null,null,null,null,null,null,null,5]
[5.125,2140.9780000000001,5.125,2024.529,null,{"$f":"F345+1","v":86},10.625,2845.2840000000001,null,null,null,null,null,null,null,null,null,86,10.625,2024.529,null,null,null,null,null,null,null,null,null,null,null,null,null,null,null,null,null,null,null,5.125]
[5.25,2156.4110000000001,5.25,2024.529,null,87,10.75,2825.6419999999998,null,null,null,null,null,null,null,null,null,87,10.75,2024.529,null,null,null,null,null,null,null,null,null,null,null,null,null,null,null,null,null,null,null,5.25]
[5.375,2170.4409999999998,5.375,2010.499,null,88,10.875,2784.9549999999999,null,null,null,null,null,null,null,null,null,88,10.875,2024.529,null,null,null,null,null,null,null,null,null,null,null,null,null,null,null,null,null,null,null,5.375]
[5.5,2201.3069999999998,5.5,2024.529,null,89,11,2766.7159999999999,null,null,null,null,null,null,null,null,null,89,11,2010.499,null,null,null,null,null,null,null,null,null,null,null,null,null,null,null,null,null,null,null,5.5]
[5.625,2215.337,5.625,2038.559,null,90,11.125,2727.4319999999998,null,null,null,null,null,null,null,null,null,90,11.125,2010.499,null,null,null,null,null,null,null,null,null,null,null,null,null,null,null,null,null,null,null,5.625]
[5.75,2247.6060000000002,5.75,2024.529,null,91,11.25,2709.1930000000002,null,null,null,null,null,null,null,null,null,91,11.25,2024.529,null,null,null,null,null,null,null,null,null,null,null,null,null,null,null,null,null,null,null,5.75]
[5.875,2263.0390000000002,5.875,2024.529,null,92,11.375,2672.7150000000001,null,null,null,null,null,null,null,null,null,92,11.375,2010.499,null,null,null,null,null,null,null,null,null,null,null,null,null,null,null,null,null,null,null,5.875]
[6,2279.875,6,2024.529,null,93,11.5,2654.4760000000001,null,null,null,null,null,null,null,null,null,93,11.5,2024.529,null,null,null,null,null,null,null,null,null,null,null,null,null,null,null,null,null,null,null,6]
[6.125,2327.5770000000002,6.125,2024.529,null,94,11.625,2617.998,null,null,null,null,null,null,null,null,null,94,11.625,2024.529,null,null,null,null,null,null,null,null,null,null,null,null,null,null,null,null,null,null,null,6.125]
[6.25,2343.0100000000002,6.25,2038.559,null,95,11.75,2564.6840000000002,null,null,null,null,null,null,null,null,null,95,11.75,2024.529,null,null,null,null,null,null,null,null,null,null,null,null,null,null,null,null,null,null,null,6.25]
[6.375,2375.279,6.375,2010.499,null,96,11.875,2545.0419999999999,null,null,null,null,null,null,null,null,null,96,11.875,2010.499,null,null,null,null,null,null,null,null,null,null,null,null,null,null,null,null,null,null,null,6.375]
[6.5,2408.951,6.5,2024.529,null,97,12,2509.9670000000001,null,null,null,null,null,null,null,null,null,97,12,2010.499,null,null,null,null,null,null,null,null,null,null,null,null,null,null,null,null,null,null,null,6.5]
[6.625,2442.623,6.625,2024.529,null,98,12.125,2493.1309999999999,null,null,null,null,null,null,null,null,null,98,12.125,2024.529,null,null,null,null,null,null,null,null,null,null,null,null,null,null,null,null,null,null,null,6.625]
[6.75,2476.2950000000001,6.75,2038.559,null,99,12.25,2442.623,null,null,null,null,null,null,null,null,null,99,12.25,2038.559,null,null,null,null,null,null,null,null,null,null,null,null,null,null,null,null,null,null,null,6.75]
[6.875,2493.1309999999999,6.875,2024.529,null,100,12.375,2408.951,null,null,null,null,null,null,null,null,null,100,12.375,2024.529,null,null,null,null,null,null,null,null,null,null,null,null,null,null,null,null,null,null,null,6.875]
[7,2509.9670000000001,7,2010.499,null,101,12.5,2375.279,null,null,null,null,null,null,null,null,null,101,12.5,2010.499,null,null,null,null,null,null,null,null,null,null,null,null,null,null,null,null,null,null,null,7]
[7.125,2545.0419999999999,7.125,2024.529,null,102,12.625,2358.4430000000002,null,null,null,null,null,null,null,null,null,102,12.625,2024.529,null,null,null,null,null,null,null,null,null,null,null,null,null,null,null,null,null,null,null,7.125]
[7.25,2581.52,7.25,2024.529,null,103,12.75,2327.5770000000002,null,null,null,null,null,null,null,null,null,103,12.75,2024.529,null,null,null,null,null,null,null,null,null,null,null,null,null,null,null,null,null,null,null,7.25]
[7.375,2598.3560000000002,7.375,2024.529,null,104,12.875,2295.308,null,null,null,null,null,null,null,null,null,104,12.875,2024.529,null,null,null,null,null,null,null,null,null,null,null,null,null,null,null,null,null,null,null,7.375]
[7.5,2636.2370000000001,7.5,2010.499,null,105,13,2279.875,null,null,null,null,null,null,null,null,null,105,13,2010.499,null,null,null,null,null,null,null,null,null,null,null,null,null,null,null,null,null,null,null,7.5]
[7.625,2654.4760000000001,7.625,2024.529,null,106,13.125,2247.6060000000002,null,null,null,null,null,null,null,null,null,106,13.125,2024.529,null,null,null,null,null,null,null,null,null,null,null,null,null,null,null,null,null,null,null,7.625]
[7.75,2690.9540000000002,7.75,2010.499,null,107,13.25,2215.337,null,null,null,null,null,null,null,null,null,107,13.25,2024.529,null,null,null,null,null,null,null,null,null,null,null,null,null,null,null,null,null,null,null,7.75]
[7.875,2709.1930000000002,7.875,2038.559,null,108,13.375,2170.4409999999998,null,null,null,null,null,null,null,null,null,108,13.375,2024.529,null,null,null,null,null,null,null,null,null,null,null,null,null,null,null,null,null,null,null,7.875]
[8,2727.4319999999998,8,2024.529,null,109,13.5,2156.4110000000001,null,null,null,null,null,null,null,null,null,109,13.5,2010.499,null,null,null,null,null,null,null,null,null,null,null,null,null,null,null,null,null,null,null,8]
[8.125,2748.4769999999999,8.125,2024.529,null,110,13.625,2140.9780000000001,null,null,null,null,null,null,null,null,null,110,13.625,2024.529,null,null,null,null,null,null,null,null,null,null,null,null,null,null,null,null,null,null,null,8.125]
[8.25,2784.9549999999999,8.25,2024.529,null,111,13.75,2126.9479999999999,null,null,null,null,null,null,null,null,null,111,13.75,2024.529,null,null,null,null,null,null,null,null,null,null,null,null,null,null,null,null,null,null,null,8.25]
[8.375,2806,8.375,2010.499,null,112,13.875,2110.1120000000001,null,null,null,null,null,null,null,null,null,112,13.875,2038.559,null,null,null,null,null,null,null,null,null,null,null,null,null,null,null,null,null,null,null,8.375]
[8.5,2825.6419999999998,8.5,2024.529,null,113,14,2096.0819999999999,null,null,null,null,null,null,null,null,null,113,14,2024.529,null,null,null,null,null,null,null,null,null,null,null,null,null,null,null,null,null,null,null,8.5]
[8.625,2825.6419999999998,8.625,2010.499,null,114,14.125,2082.0520000000001,null,null,null,null,null,null,null,null,null,114,14.125,2024.529,null,null,null,null,null,null,null,null,null,null,null,null,null,null,null,null,null,null,null,8.625]
[8.75,2864.9259999999999,8.75,2010.499,null,115,14.25,2082.0520000000001,null,null,null,null,null,null,null,null,null,115,14.25,2024.529,null,null,null,null,null,null,null,null,null,null,null,null,null,null,null,null,null,null,null,8.75]
[8.875,2884.5680000000002,8.875,2010.499,null,116,14.375,2082.0520000000001,null,null,null,null,null,null,null,null,null,116,14.375,2024.529,null,null,null,null,null,null,null,null,null,null,null,null,null,null,null,null,null,null,null,8.875]
[9,2864.9259999999999,9,2038.559,null,117,14.5,2082.0520000000001,null,null,null,null,null,null,null,null,null,117,14.5,2024.529,null,null,null,null,null,null,null,null,null,null,null,null,null,null,null,null,null,null,null,9]
[9.125,2884.5680000000002,9.125,2024.529,null,118,14.625,2082.0520000000001,null,null,null,null,null,null,null,null,null,118,14.625,2024.529,null,null,null,null,null,null,null,null,null,null,null,null,null,null,null,null,null,null,null,9.125]
[9.25,2904.21,9.25,2024.529,null,119,14.75,2096.0819999999999,null,null,null,null,null,null,null,null,null,119,14.75,2024.529,null,null,null,null,null,null,null,null,null,null,null,null,null,null,null,null,null,null,null,9.25]
[9.375,2923.8519999999999,9.375,2024.529,null,120,14.875,2096.0819999999999,null,null,null,null,null,null,null,null,null,120,14.875,2024.529,null,null,null,null,null,null,null,null,null,null,null,null,null,null,null,null,null,null,null,9.375]
[9.5,2923.8519999999999,9.5,2024.529,null,121,15,2110.1120000000001,null,null,null,null,null,null,null,null,null,121,15,2024.529,null,null,null,null,null,null,null,null,null,null,null,null,null,null,null,null,null,null,null,9.5]
[9.625,2923.8519999999999,9.625,2024.529,null,122,15.125,2126.9479999999999,null,null,null,null,null,null,null,null,null,122,15.125,2010.499,null,null,null,null,null,null,null,null,null,null,null,null,null,null,null,null,null,null,null,9.625]
[9.75,2904.21,9.75,2010.499,null,123,15.25,2156.4110000000001,null,null,null,null,null,null,null,null,null,123,15.25,2024.529,null,null,null,null,null,null,null,null,null,null,null,null,null,null,null,null,null,null,null,9.75]
[9.875,2923.8519999999999,9.875,2024.529,null,124,15.375,2170.4409999999998,null,null,null,null,null,null,null,null,null,124,15.375,2024.529,null,null,null,null,null,null,null,null,null,null,null,null,null,null,null,null,null,null,null,9.875]
[10,2904.21,10,2010.499,null,125,15.5,2185.8739999999998,null,null,null,null,null,null,null,null,null,125,15.5,2038.559,null,null,null,null,null,null,null,null,null,null,null,null,null,null,null,null,null,null,null,10]
[10.125,2904.21,10.125,2024.529,null,126,15.625,2215.337,null,null,null,null,null,null,null,null,null,126,15.625,2024.529,null,null,null,null,null,null,null,null,null,null,null,null,null,null,null,null,null,null,null,10.125]
[10.25,2884.5680000000002,10.25,2024.529,null,127,15.75,2247.6060000000002,null,null,null,null,null,null,null,null,null,127,15.75,2024.529,null,null,null,null,null,null,null,null,null,null,null,null,null,null,null,null,null,null,null,10.25]
[10.375,2884.5680000000002,10.375,2024.529,null,128,15.875,2279.875,null,null,null,null,null,null,null,null,null,128,15.875,2024.529,null,null,null,null,null,null,null,null,null,null,null,null,null,null,null,null,null,null,null,10.375]
[10.5,2864.9259999999999,10.5,2024.529,null,129,16,2295.308,null,null,null,null,null,null,null,null,null,129,16,2024.529,null,null,null,null,null,null,null,null,null,null,null,null,null,null,null,null,null,null,null,10.5]
[10.625,2845.2840000000001,10.625,2024.529,null,130,{"$f":"INDEX($A$200:$A$1200,MATCH(\"t in*\",$A$200:$A$1200,0)+F390)","v":16.125},{"$f":"INDEX($B$200:$B$1200,MATCH(\"t in*\",$A$200:$A$1200,0)+F390)","v":2327.5770000000002},null,null,null,null,null,null,null,null,null,130,{"$f":"INDEX($C$1:$C$1200,MATCH(\"t in*\",$C$1:$C$1200,0)+R390)","v":16.125},{"$f":"INDEX($D$1:$D$1200,MATCH(\"t in*\",$C$1:$C$1200,0)+R390)","v":2024.529},null,null,null,null,null,null,null,null,null,null,null,null,null,null,null,null,null,null,null,10.625]
[10.75,2825.6419999999998,10.75,2024.529,null,131,16.25,2358.4430000000002,null,null,null,null,null,null,null,null,null,{"$f":"R390+1","v":131},16.25,2024.529,null,null,null,null,null,null,null,null,null,null,null,null,null,null,null,null,null,null,null,10.75]
[10.875,2784.9549999999999,10.875,2024.529,null,132,16.375,2375.279,null,null,null,null,null,null,null,null,null,132,16.375,2038.559,null,null,null,null,null,null,null,null,null,null,null,null,null,null,null,null,null,null,null,10.875]
[11,2766.7159999999999,11,2010.499,null,133,16.5,2408.951,null,null,null,null,null,null,null,null,null,133,16.5,2024.529,null,null,null,null,null,null,null,null,null,null,null,null,null,null,null,null,null,null,null,11]
[11.125,2727.4319999999998,11.125,2010.499,null,134,16.625,2442.623,null,null,null,null,null,null,null,null,null,134,16.625,2010.499,null,null,null,null,null,null,null,null,null,null,null,null,null,null,null,null,null,null,null,11.125]
[11.25,2709.1930000000002,11.25,2024.529,null,135,16.75,2476.2950000000001,null,null,null,null,null,null,null,null,null,135,16.75,2010.499,null,null,null,null,null,null,null,null,null,null,null,null,null,null,null,null,null,null,null,11.25]
[11.375,2672.7150000000001,11.375,2010.499,null,136,16.875,2493.1309999999999,null,null,null,null,null,null,null,null,null,136,16.875,2024.529,null,null,null,null,null,null,null,null,null,null,null,null,null,null,null,null,null,null,null,11.375]
[11.5,2654.4760000000001,11.5,2024.529,null,137,17,2509.9670000000001,null,null,null,null,null,null,null,null,null,137,17,2024.529,null,null,null,null,null,null,null,null,null,null,null,null,null,null,null,null,null,null,null,11.5]
[11.625,2617.998,11.625,2024.529,null,138,17.125,2545.0419999999999,null,null,null,null,null,null,null,null,null,138,17.125,2010.499,null,null,null,null,null,null,null,null,null,null,null,null,null,null,null,null,null,null,null,11.625]
[11.75,2564.6840000000002,11.75,2024.529,null,139,17.25,2581.52,null,null,null,null,null,null,null,null,null,139,17.25,2024.529,null,null,null,null,null,null,null,null,null,null,null,null,null,null,null,null,null,null,null,11.75]
[11.875,2545.0419999999999,11.875,2010.499,null,140,17.375,2598.3560000000002,null,null,null,null,null,null,null,null,null,140,17.375,2024.529,null,null,null,null,null,null,null,null,null,null,null,null,null,null,null,null,null,null,null,11.875]
[12,2509.9670000000001,12,2010.499,null,141,17.5,2636.2370000000001,null,null,null,null,null,null,null,null,null,141,17.5,2024.529,null,null,null,null,null,null,null,null,null,null,null,null,null,null,null,null,null,null,null,12]
[12.125,2493.1309999999999,12.125,2024.529,null,142,17.625,2654.4760000000001,null,null,null,null,null,null,null,null,null,142,17.625,2024.529,null,null,null,null,null,null,null,null,null,null,null,null,null,null,null,null,null,null,null,12.125]
[12.25,2442.623,12.25,2038.559,null,143,17.75,2690.9540000000002,null,null,null,null,null,null,null,null,null,143,17.75,2024.529,null,null,null,null,null,null,null,null,null,null,null,null,null,null,null,null,null,null,null,12.25]
[12.375,2408.951,12.375,2024.529,null,144,17.875,2709.1930000000002,null,null,null,null,null,null,null,null,null,144,17.875,2024.529,null,null,null,null,null,null,null,null,null,null,null,null,null,null,null,null,null,null,null,12.375]
[12.5,2375.279,12.5,2010.499,null,145,18,2727.4319999999998,null,null,null,null,null,null,null,null,null,145,18,2024.529,null,null,null,null,null,null,null,null,null,null,null,null,null,null,null,null,null,null,null,12.5]
[12.625,2358.4430000000002,12.625,2024.529,null,146,18.125,2748.4769999999999,null,null,null,null,null,null,null,null,null,146,18.125,2010.499,null,null,null,null,null,null,null,null,null,null,null,null,null,null,null,null,null,null,null,12.625]
[12.75,2327.5770000000002,12.75,2024.529,null,147,18.25,2766.7159999999999,null,null,null,null,null,null,null,null,null,147,18.25,2024.529,null,null,null,null,null,null,null,null,null,null,null,null,null,null,null,null,null,null,null,12.75]
[12.875,2295.308,12.875,2024.529,null,148,18.375,2806,null,null,null,null,null,null,null,null,null,148,18.375,2024.529,null,null,null,null,null,null,null,null,null,null,null,null,null,null,null,null,null,null,null,12.875]
[13,2279.875,13,2010.499,null,149,18.5,2806,null,null,null,null,null,null,null,null,null,149,18.5,2038.559,null,null,null,null,null,null,null,null,null,null,null,null,null,null,null,null,null,null,null,13]
[13.125,2247.6060000000002,13.125,2024.529,null,{"$f":"F409+1","v":150},18.625,2845.2840000000001,null,null,null,null,null,null,null,null,null,150,18.625,2010.499,null,null,null,null,null,null,null,null,null,null,null,null,null,null,null,null,null,null,null,13.125]
[13.25,2215.337,13.25,2024.529,null,151,18.75,2845.2840000000001,null,null,null,null,null,null,null,null,null,151,18.75,2010.499,null,null,null,null,null,null,null,null,null,null,null,null,null,null,null,null,null,null,null,13.25]
[13.375,2170.4409999999998,13.375,2024.529,null,152,18.875,2884.5680000000002,null,null,null,null,null,null,null,null,null,152,18.875,2024.529,null,null,null,null,null,null,null,null,null,null,null,null,null,null,null,null,null,null,null,13.375]
[13.5,2156.4110000000001,13.5,2010.499,null,153,19,2884.5680000000002,null,null,null,null,null,null,null,null,null,153,19,2024.529,null,null,null,null,null,null,null,null,null,null,null,null,null,null,null,null,null,null,null,13.5]
[13.625,2140.9780000000001,13.625,2024.529,null,154,19.125,2904.21,null,null,null,null,null,null,null,null,null,154,19.125,2024.529,null,null,null,null,null,null,null,null,null,null,null,null,null,null,null,null,null,null,null,13.625]
[13.75,2126.9479999999999,13.75,2024.529,null,155,19.25,2904.21,null,null,null,null,null,null,null,null,null,155,19.25,2024.529,null,null,null,null,null,null,null,null,null,null,null,null,null,null,null,null,null,null,null,13.75]
[13.875,2110.1120000000001,13.875,2038.559,null,156,19.375,2904.21,null,null,null,null,null,null,null,null,null,156,19.375,2010.499,null,null,null,null,null,null,null,null,null,null,null,null,null,null,null,null,null,null,null,13.875]
[14,2096.0819999999999,14,2024.529,null,157,19.5,2923.8519999999999,null,null,null,null,null,null,null,null,null,157,19.5,2024.529,null,null,null,null,null,null,null,null,null,null,null,null,null,null,null,null,null,null,null,14]
[14.125,2082.0520000000001,14.125,2024.529,null,158,19.625,2904.21,null,null,null,null,null,null,null,null,null,158,19.625,2024.529,null,null,null,null,null,null,null,null,null,null,null,null,null,null,null,null,null,null,null,14.125]
[14.25,2082.0520000000001,14.25,2024.529,null,159,19.75,2904.21,null,null,null,null,null,null,null,null,null,159,19.75,2024.529,null,null,null,null,null,null,null,null,null,null,null,null,null,null,null,null,null,null,null,14.25]
[14.375,2082.0520000000001,14.375,2024.529,null,160,19.875,2904.21,null,null,null,null,null,null,null,null,null,160,19.875,2024.529,null,null,null,null,null,null,null,null,null,null,null,null,null,null,null,null,null,null,null,14.375]
[14.5,2082.0520000000001,14.5,2024.529,null,161,20,2923.8519999999999,null,null,null,null,null,null,null,null,null,161,20,2024.529,null,null,null,null,null,null,null,null,null,null,null,null,null,null,null,null,null,null,null,14.5]
[14.625,2082.0520000000001,14.625,2024.529,null,162,20.125,2904.21,null,null,null,null,null,null,null,null,null,162,20.125,2024.529,null,null,null,null,null,null,null,null,null,null,null,null,null,null,null,null,null,null,null,14.625]
[14.75,2096.0819999999999,14.75,2024.529,null,163,20.25,2884.5680000000002,null,null,null,null,null,null,null,null,null,163,20.25,2024.529,null,null,null,null,null,null,null,null,null,null,null,null,null,null,null,null,null,null,null,14.75]
[14.875,2096.0819999999999,14.875,2024.529,null,164,20.375,2884.5680000000002,null,null,null,null,null,null,null,null,null,164,20.375,2024.529,null,null,null,null,null,null,null,null,null,null,null,null,null,null,null,null,null,null,null,14.875]
[15,2110.1120000000001,15,2024.529,null,165,20.5,2864.9259999999999,null,null,null,null,null,null,null,null,null,165,20.5,2024.529,null,null,null,null,null,null,null,null,null,null,null,null,null,null,null,null,null,null,null,15]
[15.125,2126.9479999999999,15.125,2010.499,null,166,20.625,2845.2840000000001,null,null,null,null,null,null,null,null,null,166,20.625,2024.529,null,null,null,null,null,null,null,null,null,null,null,null,null,null,null,null,null,null,null,15.125]
[15.25,2156.4110000000001,15.25,2024.529,null,167,20.75,2825.6419999999998,null,null,null,null,null,null,null,null,null,167,20.75,2038.559,null,null,null,null,null,null,null,null,null,null,null,null,null,null,null,null,null,null,null,15.25]
[15.375,2170.4409999999998,15.375,2024.529,null,168,20.875,2784.9549999999999,null,null,null,null,null,null,null,null,null,168,20.875,2010.499,null,null,null,null,null,null,null,null,null,null,null,null,null,null,null,null,null,null,null,15.375]
[15.5,2185.8739999999998,15.5,2038.559,null,169,21,2766.7159999999999,null,null,null,null,null,null,null,null,null,169,21,2024.529,null,null,null,null,null,null,null,null,null,null,null,null,null,null,null,null,null,null,null,15.5]
[15.625,2215.337,15.625,2024.529,null,170,21.125,2748.4769999999999,null,null,null,null,null,null,null,null,null,170,21.125,2010.499,null,null,null,null,null,null,null,null,null,null,null,null,null,null,null,null,null,null,null,15.625]
[15.75,2247.6060000000002,15.75,2024.529,null,171,21.25,2690.9540000000002,null,null,null,null,null,null,null,null,null,171,21.25,2024.529,null,null,null,null,null,null,null,null,null,null,null,null,null,null,null,null,null,null,null,15.75]
[15.875,2279.875,15.875,2024.529,null,172,21.375,2672.7150000000001,null,null,null,null,null,null,null,null,null,172,21.375,2024.529,null,null,null,null,null,null,null,null,null,null,null,null,null,null,null,null,null,null,null,15.875]
[16,2295.308,16,2024.529,null,173,21.5,2636.2370000000001,null,null,null,null,null,null,null,null,null,173,21.5,2024.529,null,null,null,null,null,null,null,null,null,null,null,null,null,null,null,null,null,null,null,16]
[16.125,2327.5770000000002,16.125,2024.529,null,174,21.625,2617.998,null,null,null,null,null,null,null,null,null,174,21.625,2010.499,null,null,null,null,null,null,null,null,null,null,null,null,null,null,null,null,null,null,null,16.125]
[16.25,2358.4430000000002,16.25,2024.529,null,175,21.75,2564.6840000000002,null,null,null,null,null,null,null,null,null,175,21.75,2024.529,null,null,null,null,null,null,null,null,null,null,null,null,null,null,null,null,null,null,null,16.25]
[16.375,2375.279,16.375,2038.559,null,176,21.875,2526.8029999999999,null,null,null,null,null,null,null,null,null,176,21.875,2024.529,null,null,null,null,null,null,null,null,null,null,null,null,null,null,null,null,null,null,null,16.375]
[16.5,2408.951,16.5,2024.529,null,177,22,2509.9670000000001,null,null,null,null,null,null,null,null,null,177,22,2024.529,null,null,null,null,null,null,null,null,null,null,null,null,null,null,null,null,null,null,null,16.5]
[16.625,2442.623,16.625,2010.499,null,178,22.125,2493.1309999999999,null,null,null,null,null,null,null,null,null,178,22.125,2024.529,null,null,null,null,null,null,null,null,null,null,null,null,null,null,null,null,null,null,null,16.625]
[16.75,2476.2950000000001,16.75,2010.499,null,179,22.25,2459.4589999999998,null,null,null,null,null,null,null,null,null,179,22.25,2010.499,null,null,null,null,null,null,null,null,null,null,null,null,null,null,null,null,null,null,null,16.75]
[16.875,2493.1309999999999,16.875,2024.529,null,180,22.375,2408.951,null,null,null,null,null,null,null,null,null,180,22.375,2024.529,null,null,null,null,null,null,null,null,null,null,null,null,null,null,null,null,null,null,null,16.875]
[17,2509.9670000000001,17,2024.529,null,181,22.5,2375.279,null,null,null,null,null,null,null,null,null,181,22.5,2010.499,null,null,null,null,null,null,null,null,null,null,null,null,null,null,null,null,null,null,null,17]
[17.125,2545.0419999999999,17.125,2010.499,null,182,22.625,2343.0100000000002,null,null,null,null,null,null,null,null,null,182,22.625,2010.499,null,null,null,null,null,null,null,null,null,null,null,null,null,null,null,null,null,null,null,17.125]
[17.25,2581.52,17.25,2024.529,null,183,22.75,2343.0100000000002,null,null,null,null,null,null,null,null,null,183,22.75,2024.529,null,null,null,null,null,null,null,null,null,null,null,null,null,null,null,null,null,null,null,17.25]
[17.375,2598.3560000000002,17.375,2024.529,null,184,22.875,2295.308,null,null,null,null,null,null,null,null,null,184,22.875,2038.559,null,null,null,null,null,null,null,null,null,null,null,null,null,null,null,null,null,null,null,17.375]
[17.5,2636.2370000000001,17.5,2024.529,null,185,23,2279.875,null,null,null,null,null,null,null,null,null,185,23,2024.529,null,null,null,null,null,null,null,null,null,null,null,null,null,null,null,null,null,null,null,17.5]
[17.625,2654.4760000000001,17.625,2024.529,null,186,23.125,2247.6060000000002,null,null,null,null,null,null,null,null,null,186,23.125,2024.529,null,null,null,null,null,null,null,null,null,null,null,null,null,null,null,null,null,null,null,17.625]
[17.75,2690.9540000000002,17.75,2024.529,null,187,23.25,2232.1729999999998,null,null,null,null,null,null,null,null,null,187,23.25,2024.529,null,null,null,null,null,null,null,null,null,null,null,null,null,null,null,null,null,null,null,17.75]
[17.875,2709.1930000000002,17.875,2024.529,null,188,23.375,2185.8739999999998,null,null,null,null,null,null,null,null,null,188,23.375,2038.559,null,null,null,null,null,null,null,null,null,null,null,null,null,null,null,null,null,null,null,17.875]
[18,2727.4319999999998,18,2024.529,null,189,23.5,2170.4409999999998,null,null,null,null,null,null,null,null,null,189,23.5,2024.529,null,null,null,null,null,null,null,null,null,null,null,null,null,null,null,null,null,null,null,18]
[18.125,2748.4769999999999,18.125,2010.499,null,190,23.625,2140.9780000000001,null,null,null,null,null,null,null,null,null,190,23.625,2024.529,null,null,null,null,null,null,null,null,null,null,null,null,null,null,null,null,null,null,null,18.125]
[18.25,2766.7159999999999,18.25,2024.529,null,191,23.75,2126.9479999999999,null,null,null,null,null,null,null,null,null,191,23.75,2024.529,null,null,null,null,null,null,null,null,null,null,null,null,null,null,null,null,null,null,null,18.25]
[18.375,2806,18.375,2024.529,null,192,23.875,2110.1120000000001,null,null,null,null,null,null,null,null,null,192,23.875,2024.529,null,null,null,null,null,null,null,null,null,null,null,null,null,null,null,null,null,null,null,18.375]
[18.5,2806,18.5,2038.559,null,193,24,2096.0819999999999,null,null,null,null,null,null,null,null,null,193,24,2024.529,null,null,null,null,null,null,null,null,null,null,null,null,null,null,null,null,null,null,null,18.5]
[18.625,2845.2840000000001,18.625,2010.499,null,194,{"$f":"INDEX($A$200:$A$1200,MATCH(\"t in*\",$A$200:$A$1200,0)+F454)","v":24.125},{"$f":"INDEX($B$200:$B$1200,MATCH(\"t in*\",$A$200:$A$1200,0)+F454)","v":2082.0520000000001},null,null,null,null,null,null,null,null,null,194,{"$f":"INDEX($C$1:$C$1200,MATCH(\"t in*\",$C$1:$C$1200,0)+R454)","v":24.125},{"$f":"INDEX($D$1:$D$1200,MATCH(\"t in*\",$C$1:$C$1200,0)+R454)","v":2010.499},null,null,null,null,null,null,null,null,null,null,null,null,null,null,null,null,null,null,null,18.625]
[18.75,2845.2840000000001,18.75,2010.499,null,195,24.25,2082.0520000000001,null,null,null,null,null,null,null,null,null,{"$f":"R454+1","v":195},24.25,2024.529,null,null,null,null,null,null,null,null,null,null,null,null,null,null,null,null,null,null,null,18.75]
[18.875,2884.5680000000002,18.875,2024.529,null,196,24.375,2082.0520000000001,null,null,null,null,null,null,null,null,null,196,24.375,2010.499,null,null,null,null,null,null,null,null,null,null,null,null,null,null,null,null,null,null,null,18.875]
[19,2884.5680000000002,19,2024.529,null,197,24.5,2082.0520000000001,null,null,null,null,null,null,null,null,null,197,24.5,2024.529,null,null,null,null,null,null,null,null,null,null,null,null,null,null,null,null,null,null,null,19]
[19.125,2904.21,19.125,2024.529,null,198,24.625,2082.0520000000001,null,null,null,null,null,null,null,null,null,198,24.625,2024.529,null,null,null,null,null,null,null,null,null,null,null,null,null,null,null,null,null,null,null,19.125]
[19.25,2904.21,19.25,2024.529,null,199,24.75,2096.0819999999999,null,null,null,null,null,null,null,null,null,199,24.75,2010.499,null,null,null,null,null,null,null,null,null,null,null,null,null,null,null,null,null,null,null,19.25]
[19.375,2904.21,19.375,2010.499,null,200,24.875,2110.1120000000001,null,null,null,null,null,null,null,null,null,200,24.875,2010.499,null,null,null,null,null,null,null,null,null,null,null,null,null,null,null,null,null,null,null,19.375]
[19.5,2923.8519999999999,19.5,2024.529,null,201,25,2110.1120000000001,null,null,null,null,null,null,null,null,null,201,25,2024.529,null,null,null,null,null,null,null,null,null,null,null,null,null,null,null,null,null,null,null,19.5]
[19.625,2904.21,19.625,2024.529,null,202,25.125,2126.9479999999999,null,null,null,null,null,null,null,null,null,202,25.125,2024.529,null,null,null,null,null,null,null,null,null,null,null,null,null,null,null,null,null,null,null,19.625]
[19.75,2904.21,19.75,2024.529,null,203,25.25,2156.4110000000001,null,null,null,null,null,null,null,null,null,203,25.25,2010.499,null,null,null,null,null,null,null,null,null,null,null,null,null,null,null,null,null,null,null,19.75]
[19.875,2904.21,19.875,2024.529,null,204,25.375,2156.4110000000001,null,null,null,null,null,null,null,null,null,204,25.375,2024.529,null,null,null,null,null,null,null,null,null,null,null,null,null,null,null,null,null,null,null,19.875]
[20,2923.8519999999999,20,2024.529,null,205,25.5,2185.8739999999998,null,null,null,null,null,null,null,null,null,205,25.5,2010.499,null,null,null,null,null,null,null,null,null,null,null,null,null,null,null,null,null,null,null,20]
[20.125,2904.21,20.125,2024.529,null,206,25.625,2215.337,null,null,null,null,null,null,null,null,null,206,25.625,2024.529,null,null,null,null,null,null,null,null,null,null,null,null,null,null,null,null,null,null,null,20.125]
[20.25,2884.5680000000002,20.25,2024.529,null,207,25.75,2247.6060000000002,null,null,null,null,null,null,null,null,null,207,25.75,2024.529,null,null,null,null,null,null,null,null,null,null,null,null,null,null,null,null,null,null,null,20.25]
[20.375,2884.5680000000002,20.375,2024.529,null,208,25.875,2263.0390000000002,null,null,null,null,null,null,null,null,null,208,25.875,2024.529,null,null,null,null,null,null,null,null,null,null,null,null,null,null,null,null,null,null,null,20.375]
[20.5,2864.9259999999999,20.5,2024.529,null,209,26,2295.308,null,null,null,null,null,null,null,null,null,209,26,2024.529,null,null,null,null,null,null,null,null,null,null,null,null,null,null,null,null,null,null,null,20.5]
[20.625,2845.2840000000001,20.625,2024.529,null,210,26.125,2310.741,null,null,null,null,null,null,null,null,null,210,26.125,2024.529,null,null,null,null,null,null,null,null,null,null,null,null,null,null,null,null,null,null,null,20.625]
[20.75,2825.6419999999998,20.75,2038.559,null,211,26.25,2343.0100000000002,null,null,null,null,null,null,null,null,null,211,26.25,2024.529,null,null,null,null,null,null,null,null,null,null,null,null,null,null,null,null,null,null,null,20.75]
[20.875,2784.9549999999999,20.875,2010.499,null,212,26.375,2375.279,null,null,null,null,null,null,null,null,null,212,26.375,2024.529,null,null,null,null,null,null,null,null,null,null,null,null,null,null,null,null,null,null,null,20.875]
[21,2766.7159999999999,21,2024.529,null,213,26.5,2408.951,null,null,null,null,null,null,null,null,null,213,26.5,2024.529,null,null,null,null,null,null,null,null,null,null,null,null,null,null,null,null,null,null,null,21]
[21.125,2748.4769999999999,21.125,2010.499,null,{"$f":"F473+1","v":214},26.625,2442.623,null,null,null,null,null,null,null,null,null,214,26.625,2024.529,null,null,null,null,null,null,null,null,null,null,null,null,null,null,null,null,null,null,null,21.125]
[21.25,2690.9540000000002,21.25,2024.529,null,215,26.75,2476.2950000000001,null,null,null,null,null,null,null,null,null,215,26.75,2024.529,null,null,null,null,null,null,null,null,null,null,null,null,null,null,null,null,null,null,null,21.25]
[21.375,2672.7150000000001,21.375,2024.529,null,216,26.875,2493.1309999999999,null,null,null,null,null,null,null,null,null,216,26.875,2024.529,null,null,null,null,null,null,null,null,null,null,null,null,null,null,null,null,null,null,null,21.375]
[21.5,2636.2370000000001,21.5,2024.529,null,217,27,2509.9670000000001,null,null,null,null,null,null,null,null,null,217,27,2024.529,null,null,null,null,null,null,null,null,null,null,null,null,null,null,null,null,null,null,null,21.5]
[21.625,2617.998,21.625,2010.499,null,218,27.125,2545.0419999999999,null,null,null,null,null,null,null,null,null,218,27.125,2024.529,null,null,null,null,null,null,null,null,null,null,null,null,null,null,null,null,null,null,null,21.625]
[21.75,2564.6840000000002,21.75,2024.529,null,219,27.25,2564.6840000000002,null,null,null,null,null,null,null,null,null,219,27.25,2024.529,null,null,null,null,null,null,null,null,null,null,null,null,null,null,null,null,null,null,null,21.75]
[21.875,2526.8029999999999,21.875,2024.529,null,220,27.375,2598.3560000000002,null,null,null,null,null,null,null,null,null,220,27.375,2010.499,null,null,null,null,null,null,null,null,null,null,null,null,null,null,null,null,null,null,null,21.875]
[22,2509.9670000000001,22,2024.529,null,221,27.5,2617.998,null,null,null,null,null,null,null,null,null,221,27.5,2024.529,null,null,null,null,null,null,null,null,null,null,null,null,null,null,null,null,null,null,null,22]
[22.125,2493.1309999999999,22.125,2024.529,null,222,27.625,2654.4760000000001,null,null,null,null,null,null,null,null,null,222,27.625,2024.529,null,null,null,null,null,null,null,null,null,null,null,null,null,null,null,null,null,null,null,22.125]
[22.25,2459.4589999999998,22.25,2010.499,null,223,27.75,2672.7150000000001,null,null,null,null,null,null,null,null,null,223,27.75,2024.529,null,null,null,null,null,null,null,null,null,null,null,null,null,null,null,null,null,null,null,22.25]
[22.375,2408.951,22.375,2024.529,null,224,27.875,2709.1930000000002,null,null,null,null,null,null,null,null,null,224,27.875,2024.529,null,null,null,null,null,null,null,null,null,null,null,null,null,null,null,null,null,null,null,22.375]
[22.5,2375.279,22.5,2010.499,null,225,28,2727.4319999999998,null,null,null,null,null,null,null,null,null,225,28,2010.499,null,null,null,null,null,null,null,null,null,null,null,null,null,null,null,null,null,null,null,22.5]
[22.625,2343.0100000000002,22.625,2010.499,null,226,28.125,2766.7159999999999,null,null,null,null,null,null,null,null,null,226,28.125,2024.529,null,null,null,null,null,null,null,null,null,null,null,null,null,null,null,null,null,null,null,22.625]
[22.75,2343.0100000000002,22.75,2024.529,null,227,28.25,2766.7159999999999,null,null,null,null,null,null,null,null,null,227,28.25,2010.499,null,null,null,null,null,null,null,null,null,null,null,null,null,null,null,null,null,null,null,22.75]
[22.875,2295.308,22.875,2038.559,null,228,28.375,2784.9549999999999,null,null,null,null,null,null,null,null,null,228,28.375,2024.529,null,null,null,null,null,null,null,null,null,null,null,null,null,null,null,null,null,null,null,22.875]
[23,2279.875,23,2024.529,null,229,28.5,2806,null,null,null,null,null,null,null,null,null,229,28.5,2010.499,null,null,null,null,null,null,null,null,null,null,null,null,null,null,null,null,null,null,null,23]
[23.125,2247.6060000000002,23.125,2024.529,null,230,28.625,2825.6419999999998,null,null,null,null,null,null,null,null,null,230,28.625,2024.529,null,null,null,null,null,null,null,null,null,null,null,null,null,null,null,null,null,null,null,23.125]
[23.25,2232.1729999999998,23.25,2024.529,null,231,28.75,2864.9259999999999,null,null,null,null,null,null,null,null,null,231,28.75,2010.499,null,null,null,null,null,null,null,null,null,null,null,null,null,null,null,null,null,null,null,23.25]
[23.375,2185.8739999999998,23.375,2038.559,null,232,28.875,2864.9259999999999,null,null,null,null,null,null,null,null,null,232,28.875,2024.529,null,null,null,null,null,null,null,null,null,null,null,null,null,null,null,null,null,null,null,23.375]
[23.5,2170.4409999999998,23.5,2024.529,null,233,29,2884.5680000000002,null,null,null,null,null,null,null,null,null,233,29,2024.529,null,null,null,null,null,null,null,null,null,null,null,null,null,null,null,null,null,null,null,23.5]
[23.625,2140.9780000000001,23.625,2024.529,null,234,29.125,2884.5680000000002,null,null,null,null,null,null,null,null,null,234,29.125,2010.499,null,null,null,null,null,null,null,null,null,null,null,null,null,null,null,null,null,null,null,23.625]
[23.75,2126.9479999999999,23.75,2024.529,null,235,29.25,2904.21,null,null,null,null,null,null,null,null,null,235,29.25,2024.529,null,null,null,null,null,null,null,null,null,null,null,null,null,null,null,null,null,null,null,23.75]
[23.875,2110.1120000000001,23.875,2024.529,null,236,29.375,2904.21,null,null,null,null,null,null,null,null,null,236,29.375,2010.499,null,null,null,null,null,null,null,null,null,null,null,null,null,null,null,null,null,null,null,23.875]
[24,2096.0819999999999,24,2024.529,null,237,29.5,2904.21,null,null,null,null,null,null,null,null,null,237,29.5,2024.529,null,null,null,null,null,null,null,null,null,null,null,null,null,null,null,null,null,null,null,24]
[24.125,2082.0520000000001,24.125,2010.499,null,238,29.625,2904.21,null,null,null,null,null,null,null,null,null,238,29.625,2010.499,null,null,null,null,null,null,null,null,null,null,null,null,null,null,null,null,null,null,null,24.125]
[24.25,2082.0520000000001,24.25,2024.529,null,239,29.75,2923.8519999999999,null,null,null,null,null,null,null,null,null,239,29.75,2010.499,null,null,null,null,null,null,null,null,null,null,null,null,null,null,null,null,null,null,null,24.25]
[24.375,2082.0520000000001,24.375,2010.499,null,240,29.875,2904.21,null,null,null,null,null,null,null,null,null,240,29.875,2010.499,null,null,null,null,null,null,null,null,null,null,null,null,null,null,null,null,null,null,null,24.375]
[24.5,2082.0520000000001,24.5,2024.529,null,241,30,2904.21,null,null,null,null,null,null,null,null,null,241,30,2024.529,null,null,null,null,null,null,null,null,null,null,null,null,null,null,null,null,null,null,null,24.5]
[24.625,2082.0520000000001,24.625,2024.529,null,242,30.125,2904.21,null,null,null,null,null,null,null,null,null,242,30.125,2010.499,null,null,null,null,null,null,null,null,null,null,null,null,null,null,null,null,null,null,null,24.625]
[24.75,2096.0819999999999,24.75,2010.499,null,243,30.25,2884.5680000000002,null,null,null,null,null,null,null,null,null,243,30.25,2010.499,null,null,null,null,null,null,null,null,null,null,null,null,null,null,null,null,null,null,null,24.75]
[24.875,2110.1120000000001,24.875,2010.499,null,244,30.375,2884.5680000000002,null,null,null,null,null,null,null,null,null,244,30.375,2024.529,null,null,null,null,null,null,null,null,null,null,null,null,null,null,null,null,null,null,null,24.875]
[25,2110.1120000000001,25,2024.529,null,245,30.5,2845.2840000000001,null,null,null,null,null,null,null,null,null,245,30.5,2010.499,null,null,null,null,null,null,null,null,null,null,null,null,null,null,null,null,null,null,null,25]
[25.125,2126.9479999999999,25.125,2024.529,null,246,30.625,2845.2840000000001,null,null,null,null,null,null,null,null,null,246,30.625,2024.529,null,null,null,null,null,null,null,null,null,null,null,null,null,null,null,null,null,null,null,25.125]
[25.25,2156.4110000000001,25.25,2010.499,null,247,30.75,2806,null,null,null,null,null,null,null,null,null,247,30.75,2010.499,null,null,null,null,null,null,null,null,null,null,null,null,null,null,null,null,null,null,null,25.25]
[25.375,2156.4110000000001,25.375,2024.529,null,248,30.875,2806,null,null,null,null,null,null,null,null,null,248,30.875,2024.529,null,null,null,null,null,null,null,null,null,null,null,null,null,null,null,null,null,null,null,25.375]
[25.5,2185.8739999999998,25.5,2010.499,null,249,31,2766.7159999999999,null,null,null,null,null,null,null,null,null,249,31,2024.529,null,null,null,null,null,null,null,null,null,null,null,null,null,null,null,null,null,null,null,25.5]
[25.625,2215.337,25.625,2024.529,null,250,31.125,2727.4319999999998,null,null,null,null,null,null,null,null,null,250,31.125,2024.529,null,null,null,null,null,null,null,null,null,null,null,null,null,null,null,null,null,null,null,25.625]
[25.75,2247.6060000000002,25.75,2024.529,null,251,31.25,2709.1930000000002,null,null,null,null,null,null,null,null,null,251,31.25,2010.499,null,null,null,null,null,null,null,null,null,null,null,null,null,null,null,null,null,null,null,25.75]
[25.875,2263.0390000000002,25.875,2024.529,null,252,31.375,2672.7150000000001,null,null,null,null,null,null,null,null,null,252,31.375,2010.499,null,null,null,null,null,null,null,null,null,null,null,null,null,null,null,null,null,null,null,25.875]
[26,2295.308,26,2024.529,null,253,31.5,2636.2370000000001,null,null,null,null,null,null,null,null,null,253,31.5,2024.529,null,null,null,null,null,null,null,null,null,null,null,null,null,null,null,null,null,null,null,26]
[26.125,2310.741,26.125,2024.529,null,254,31.625,2598.3560000000002,null,null,null,null,null,null,null,null,null,254,31.625,2038.559,null,null,null,null,null,null,null,null,null,null,null,null,null,null,null,null,null,null,null,26.125]
[26.25,2343.0100000000002,26.25,2024.529,null,255,31.75,2581.52,null,null,null,null,null,null,null,null,null,255,31.75,2010.499,null,null,null,null,null,null,null,null,null,null,null,null,null,null,null,null,null,null,null,26.25]
[26.375,2375.279,26.375,2024.529,null,256,31.875,2545.0419999999999,null,null,null,null,null,null,null,null,null,256,31.875,2024.529,null,null,null,null,null,null,null,null,null,null,null,null,null,null,null,null,null,null,null,26.375]
[26.5,2408.951,26.5,2024.529,null,257,32,2509.9670000000001,null,null,null,null,null,null,null,null,null,257,32,2010.499,null,null,null,null,null,null,null,null,null,null,null,null,null,null,null,null,null,null,null,26.5]
[26.625,2442.623,26.625,2024.529,null,258,{"$f":"INDEX($A$200:$A$1200,MATCH(\"t in*\",$A$200:$A$1200,0)+F518)","v":32.125},{"$f":"INDEX($B$200:$B$1200,MATCH(\"t in*\",$A$200:$A$1200,0)+F518)","v":2476.2950000000001},null,null,null,null,null,null,null,null,null,258,{"$f":"INDEX($C$1:$C$1200,MATCH(\"t in*\",$C$1:$C$1200,0)+R518)","v":32.125},{"$f":"INDEX($D$1:$D$1200,MATCH(\"t in*\",$C$1:$C$1200,0)+R518)","v":2024.529},null,null,null,null,null,null,null,null,null,null,null,null,null,null,null,null,null,null,null,26.625]
[26.75,2476.2950000000001,26.75,2024.529,null,259,32.25,2459.4589999999998,null,null,null,null,null,null,null,null,null,{"$f":"R518+1","v":259},32.25,2010.499,null,null,null,null,null,null,null,null,null,null,null,null,null,null,null,null,null,null,null,26.75]
[26.875,2493.1309999999999,26.875,2024.529,null,260,32.375,2408.951,null,null,null,null,null,null,null,null,null,260,32.375,2010.499,null,null,null,null,null,null,null,null,null,null,null,null,null,null,null,null,null,null,null,26.875]
[27,2509.9670000000001,27,2024.529,null,261,32.5,2393.518,null,null,null,null,null,null,null,null,null,261,32.5,2010.499,null,null,null,null,null,null,null,null,null,null,null,null,null,null,null,null,null,null,null,27]
[27.125,2545.0419999999999,27.125,2024.529,null,262,32.625,2358.4430000000002,null,null,null,null,null,null,null,null,null,262,32.625,2010.499,null,null,null,null,null,null,null,null,null,null,null,null,null,null,null,null,null,null,null,27.125]
[27.25,2564.6840000000002,27.25,2024.529,null,263,32.75,2327.5770000000002,null,null,null,null,null,null,null,null,null,263,32.75,2010.499,null,null,null,null,null,null,null,null,null,null,null,null,null,null,null,null,null,null,null,27.25]
[27.375,2598.3560000000002,27.375,2010.499,null,264,32.875,2295.308,null,null,null,null,null,null,null,null,null,264,32.875,2010.499,null,null,null,null,null,null,null,null,null,null,null,null,null,null,null,null,null,null,null,27.375]
[27.5,2617.998,27.5,2024.529,null,265,33,2263.0390000000002,null,null,null,null,null,null,null,null,null,265,33,2024.529,null,null,null,null,null,null,null,null,null,null,null,null,null,null,null,null,null,null,null,27.5]
[27.625,2654.4760000000001,27.625,2024.529,null,266,33.125,2247.6060000000002,null,null,null,null,null,null,null,null,null,266,33.125,2024.529,null,null,null,null,null,null,null,null,null,null,null,null,null,null,null,null,null,null,null,27.625]
[27.75,2672.7150000000001,27.75,2024.529,null,267,33.25,2215.337,null,null,null,null,null,null,null,null,null,267,33.25,2024.529,null,null,null,null,null,null,null,null,null,null,null,null,null,null,null,null,null,null,null,27.75]
[27.875,2709.1930000000002,27.875,2024.529,null,268,33.375,2185.8739999999998,null,null,null,null,null,null,null,null,null,268,33.375,2024.529,null,null,null,null,null,null,null,null,null,null,null,null,null,null,null,null,null,null,null,27.875]
[28,2727.4319999999998,28,2010.499,null,269,33.5,2156.4110000000001,null,null,null,null,null,null,null,null,null,269,33.5,2024.529,null,null,null,null,null,null,null,null,null,null,null,null,null,null,null,null,null,null,null,28]
[28.125,2766.7159999999999,28.125,2024.529,null,270,33.625,2140.9780000000001,null,null,null,null,null,null,null,null,null,270,33.625,2010.499,null,null,null,null,null,null,null,null,null,null,null,null,null,null,null,null,null,null,null,28.125]
[28.25,2766.7159999999999,28.25,2010.499,null,271,33.75,2126.9479999999999,null,null,null,null,null,null,null,null,null,271,33.75,2010.499,null,null,null,null,null,null,null,null,null,null,null,null,null,null,null,null,null,null,null,28.25]
[28.375,2784.9549999999999,28.375,2024.529,null,272,33.875,2110.1120000000001,null,null,null,null,null,null,null,null,null,272,33.875,2010.499,null,null,null,null,null,null,null,null,null,null,null,null,null,null,null,null,null,null,null,28.375]
[28.5,2806,28.5,2010.499,null,273,34,2096.0819999999999,null,null,null,null,null,null,null,null,null,273,34,2010.499,null,null,null,null,null,null,null,null,null,null,null,null,null,null,null,null,null,null,null,28.5]
[28.625,2825.6419999999998,28.625,2024.529,null,274,34.125,2082.0520000000001,null,null,null,null,null,null,null,null,null,274,34.125,2024.529,null,null,null,null,null,null,null,null,null,null,null,null,null,null,null,null,null,null,null,28.625]
[28.75,2864.9259999999999,28.75,2010.499,null,275,34.25,2066.6190000000001,null,null,null,null,null,null,null,null,null,275,34.25,2010.499,null,null,null,null,null,null,null,null,null,null,null,null,null,null,null,null,null,null,null,28.75]
[28.875,2864.9259999999999,28.875,2024.529,null,276,34.375,2082.0520000000001,null,null,null,null,null,null,null,null,null,276,34.375,2010.499,null,null,null,null,null,null,null,null,null,null,null,null,null,null,null,null,null,null,null,28.875]
[29,2884.5680000000002,29,2024.529,null,277,34.5,2082.0520000000001,null,null,null,null,null,null,null,null,null,277,34.5,2010.499,null,null,null,null,null,null,null,null,null,null,null,null,null,null,null,null,null,null,null,29]
[29.125,2884.5680000000002,29.125,2010.499,null,{"$f":"F537+1","v":278},34.625,2082.0520000000001,null,null,null,null,null,null,null,null,null,278,34.625,2024.529,null,null,null,null,null,null,null,null,null,null,null,null,null,null,null,null,null,null,null,29.125]
[29.25,2904.21,29.25,2024.529,null,279,34.75,2082.0520000000001,null,null,null,null,null,null,null,null,null,279,34.75,2010.499,null,null,null,null,null,null,null,null,null,null,null,null,null,null,null,null,null,null,null,29.25]
[29.375,2904.21,29.375,2010.499,null,280,34.875,2096.0819999999999,null,null,null,null,null,null,null,null,null,280,34.875,2024.529,null,null,null,null,null,null,null,null,null,null,null,null,null,null,null,null,null,null,null,29.375]
[29.5,2904.21,29.5,2024.529,null,281,35,2110.1120000000001,null,null,null,null,null,null,null,null,null,281,35,2024.529,null,null,null,null,null,null,null,null,null,null,null,null,null,null,null,null,null,null,null,29.5]
[29.625,2904.21,29.625,2010.499,null,282,35.125,2126.9479999999999,null,null,null,null,null,null,null,null,null,282,35.125,2024.529,null,null,null,null,null,null,null,null,null,null,null,null,null,null,null,null,null,null,null,29.625]
[29.75,2923.8519999999999,29.75,2010.499,null,283,35.25,2140.9780000000001,null,null,null,null,null,null,null,null,null,283,35.25,2024.529,null,null,null,null,null,null,null,null,null,null,null,null,null,null,null,null,null,null,null,29.75]
[29.875,2904.21,29.875,2010.499,null,284,35.375,2156.4110000000001,null,null,null,null,null,null,null,null,null,284,35.375,2024.529,null,null,null,null,null,null,null,null,null,null,null,null,null,null,null,null,null,null,null,29.875]
[30,2904.21,30,2024.529,null,285,35.5,2185.8739999999998,null,null,null,null,null,null,null,null,null,285,35.5,2024.529,null,null,null,null,null,null,null,null,null,null,null,null,null,null,null,null,null,null,null,30]
[30.125,2904.21,30.125,2010.499,null,286,35.625,2215.337,null,null,null,null,null,null,null,null,null,286,35.625,2010.499,null,null,null,null,null,null,null,null,null,null,null,null,null,null,null,null,null,null,null,30.125]
[30.25,2884.5680000000002,30.25,2010.499,null,287,35.75,2232.1729999999998,null,null,null,null,null,null,null,null,null,287,35.75,2024.529,null,null,null,null,null,null,null,null,null,null,null,null,null,null,null,null,null,null,null,30.25]
[30.375,2884.5680000000002,30.375,2024.529,null,288,35.875,2263.0390000000002,null,null,null,null,null,null,null,null,null,288,35.875,2024.529,null,null,null,null,null,null,null,null,null,null,null,null,null,null,null,null,null,null,null,30.375]
[30.5,2845.2840000000001,30.5,2010.499,null,289,36,2279.875,null,null,null,null,null,null,null,null,null,289,36,2024.529,null,null,null,null,null,null,null,null,null,null,null,null,null,null,null,null,null,null,null,30.5]
[30.625,2845.2840000000001,30.625,2024.529,null,290,36.125,2310.741,null,null,null,null,null,null,null,null,null,290,36.125,2024.529,null,null,null,null,null,null,null,null,null,null,null,null,null,null,null,null,null,null,null,30.625]
[30.75,2806,30.75,2010.499,null,291,36.25,2343.0100000000002,null,null,null,null,null,null,null,null,null,291,36.25,2024.529,null,null,null,null,null,null,null,null,null,null,null,null,null,null,null,null,null,null,null,30.75]
[30.875,2806,30.875,2024.529,null,292,36.375,2358.4430000000002,null,null,null,null,null,null,null,null,null,292,36.375,2010.499,null,null,null,null,null,null,null,null,null,null,null,null,null,null,null,null,null,null,null,30.875]
[31,2766.7159999999999,31,2024.529,null,293,36.5,2408.951,null,null,null,null,null,null,null,null,null,293,36.5,2010.499,null,null,null,null,null,null,null,null,null,null,null,null,null,null,null,null,null,null,null,31]
[31.125,2727.4319999999998,31.125,2024.529,null,294,36.625,2442.623,null,null,null,null,null,null,null,null,null,294,36.625,2010.499,null,null,null,null,null,null,null,null,null,null,null,null,null,null,null,null,null,null,null,31.125]
[31.25,2709.1930000000002,31.25,2010.499,null,295,36.75,2459.4589999999998,null,null,null,null,null,null,null,null,null,295,36.75,2010.499,null,null,null,null,null,null,null,null,null,null,null,null,null,null,null,null,null,null,null,31.25]
[31.375,2672.7150000000001,31.375,2010.499,null,296,36.875,2493.1309999999999,null,null,null,null,null,null,null,null,null,296,36.875,2024.529,null,null,null,null,null,null,null,null,null,null,null,null,null,null,null,null,null,null,null,31.375]
[31.5,2636.2370000000001,31.5,2024.529,null,297,37,2509.9670000000001,null,null,null,null,null,null,null,null,null,297,37,2010.499,null,null,null,null,null,null,null,null,null,null,null,null,null,null,null,null,null,null,null,31.5]
[31.625,2598.3560000000002,31.625,2038.559,null,298,37.125,2564.6840000000002,null,null,null,null,null,null,null,null,null,298,37.125,2010.499,null,null,null,null,null,null,null,null,null,null,null,null,null,null,null,null,null,null,null,31.625]
[31.75,2581.52,31.75,2010.499,null,299,37.25,2564.6840000000002,null,null,null,null,null,null,null,null,null,299,37.25,2010.499,null,null,null,null,null,null,null,null,null,null,null,null,null,null,null,null,null,null,null,31.75]
[31.875,2545.0419999999999,31.875,2024.529,null,300,37.375,2598.3560000000002,null,null,null,null,null,null,null,null,null,300,37.375,2024.529,null,null,null,null,null,null,null,null,null,null,null,null,null,null,null,null,null,null,null,31.875]
[32,2509.9670000000001,32,2010.499,null,301,37.5,2617.998,null,null,null,null,null,null,null,null,null,301,37.5,2010.499,null,null,null,null,null,null,null,null,null,null,null,null,null,null,null,null,null,null,null,32]
[32.125,2476.2950000000001,32.125,2024.529,null,302,37.625,2654.4760000000001,null,null,null,null,null,null,null,null,null,302,37.625,2024.529,null,null,null,null,null,null,null,null,null,null,null,null,null,null,null,null,null,null,null,32.125]
[32.25,2459.4589999999998,32.25,2010.499,null,303,37.75,2672.7150000000001,null,null,null,null,null,null,null,null,null,303,37.75,2024.529,null,null,null,null,null,null,null,null,null,null,null,null,null,null,null,null,null,null,null,32.25]
[32.375,2408.951,32.375,2010.499,null,304,37.875,2690.9540000000002,null,null,null,null,null,null,null,null,null,304,37.875,2024.529,null,null,null,null,null,null,null,null,null,null,null,null,null,null,null,null,null,null,null,32.375]
[32.5,2393.518,32.5,2010.499,null,305,38,2709.1930000000002,null,null,null,null,null,null,null,null,null,305,38,2010.499,null,null,null,null,null,null,null,null,null,null,null,null,null,null,null,null,null,null,null,32.5]
[32.625,2358.4430000000002,32.625,2010.499,null,306,38.125,2727.4319999999998,null,null,null,null,null,null,null,null,null,306,38.125,2010.499,null,null,null,null,null,null,null,null,null,null,null,null,null,null,null,null,null,null,null,32.625]
[32.75,2327.5770000000002,32.75,2010.499,null,307,38.25,2784.9549999999999,null,null,null,null,null,null,null,null,null,307,38.25,2010.499,null,null,null,null,null,null,null,null,null,null,null,null,null,null,null,null,null,null,null,32.75]
[32.875,2295.308,32.875,2010.499,null,308,38.375,2784.9549999999999,null,null,null,null,null,null,null,null,null,308,38.375,2010.499,null,null,null,null,null,null,null,null,null,null,null,null,null,null,null,null,null,null,null,32.875]
[33,2263.0390000000002,33,2024.529,null,309,38.5,2806,null,null,null,null,null,null,null,null,null,309,38.5,2024.529,null,null,null,null,null,null,null,null,null,null,null,null,null,null,null,null,null,null,null,33]
[33.125,2247.6060000000002,33.125,2024.529,null,310,38.625,2825.6419999999998,null,null,null,null,null,null,null,null,null,310,38.625,2010.499,null,null,null,null,null,null,null,null,null,null,null,null,null,null,null,null,null,null,null,33.125]
[33.25,2215.337,33.25,2024.529,null,311,38.75,2864.9259999999999,null,null,null,null,null,null,null,null,null,311,38.75,2024.529,null,null,null,null,null,null,null,null,null,null,null,null,null,null,null,null,null,null,null,33.25]
[33.375,2185.8739999999998,33.375,2024.529,null,312,38.875,2864.9259999999999,null,null,null,null,null,null,null,null,null,312,38.875,2024.529,null,null,null,null,null,null,null,null,null,null,null,null,null,null,null,null,null,null,null,33.375]
[33.5,2156.4110000000001,33.5,2024.529,null,313,39,2884.5680000000002,null,null,null,null,null,null,null,null,null,313,39,2024.529,null,null,null,null,null,null,null,null,null,null,null,null,null,null,null,null,null,null,null,33.5]
[33.625,2140.9780000000001,33.625,2010.499,null,314,39.125,2884.5680000000002,null,null,null,null,null,null,null,null,null,314,39.125,2024.529,null,null,null,null,null,null,null,null,null,null,null,null,null,null,null,null,null,null,null,33.625]
[33.75,2126.9479999999999,33.75,2010.499,null,315,39.25,2904.21,null,null,null,null,null,null,null,null,null,315,39.25,2010.499,null,null,null,null,null,null,null,null,null,null,null,null,null,null,null,null,null,null,null,33.75]
[33.875,2110.1120000000001,33.875,2010.499,null,316,39.375,2923.8519999999999,null,null,null,null,null,null,null,null,null,316,39.375,2010.499,null,null,null,null,null,null,null,null,null,null,null,null,null,null,null,null,null,null,null,33.875]
[34,2096.0819999999999,34,2010.499,null,317,39.5,2904.21,null,null,null,null,null,null,null,null,null,317,39.5,2024.529,null,null,null,null,null,null,null,null,null,null,null,null,null,null,null,null,null,null,null,34]
[34.125,2082.0520000000001,34.125,2024.529,null,318,39.625,2923.8519999999999,null,null,null,null,null,null,null,null,null,318,39.625,2010.499,null,null,null,null,null,null,null,null,null,null,null,null,null,null,null,null,null,null,null,34.125]
[34.25,2066.6190000000001,34.25,2010.499,null,319,39.75,2904.21,null,null,null,null,null,null,null,null,null,319,39.75,2024.529,null,null,null,null,null,null,null,null,null,null,null,null,null,null,null,null,null,null,null,34.25]
[34.375,2082.0520000000001,34.375,2010.499,null,320,39.875,2923.8519999999999,null,null,null,null,null,null,null,null,null,320,39.875,2024.529,null,null,null,null,null,null,null,null,null,null,null,null,null,null,null,null,null,null,null,34.375]
[34.5,2082.0520000000001,34.5,2010.499,null,321,40,2904.21,null,null,null,null,null,null,null,null,null,321,40,2010.499,null,null,null,null,null,null,null,null,null,null,null,null,null,null,null,null,null,null,null,34.5]
[34.625,2082.0520000000001,34.625,2024.529,null,322,{"$f":"INDEX($A$200:$A$1200,MATCH(\"t in*\",$A$200:$A$1200,0)+F582)","v":40.125},{"$f":"INDEX($B$200:$B$1200,MATCH(\"t in*\",$A$200:$A$1200,0)+F582)","v":2904.21},null,null,null,null,null,null,null,null,null,322,{"$f":"INDEX($C$1:$C$1200,MATCH(\"t in*\",$C$1:$C$1200,0)+R582)","v":40.125},{"$f":"INDEX($D$1:$D$1200,MATCH(\"t in*\",$C$1:$C$1200,0)+R582)","v":2024.529},null,null,null,null,null,null,null,null,null,null,null,null,null,null,null,null,null,null,null,34.625]
[34.75,2082.0520000000001,34.75,2010.499,null,323,40.25,2884.5680000000002,null,null,null,null,null,null,null,null,null,{"$f":"R582+1","v":323},40.25,2024.529,null,null,null,null,null,null,null,null,null,null,null,null,null,null,null,null,null,null,null,34.75]
[34.875,2096.0819999999999,34.875,2024.529,null,324,40.375,2884.5680000000002,null,null,null,null,null,null,null,null,null,324,40.375,2010.499,null,null,null,null,null,null,null,null,null,null,null,null,null,null,null,null,null,null,null,34.875]
[35,2110.1120000000001,35,2024.529,null,325,40.5,2864.9259999999999,null,null,null,null,null,null,null,null,null,325,40.5,2010.499,null,null,null,null,null,null,null,null,null,null,null,null,null,null,null,null,null,null,null,35]
[35.125,2126.9479999999999,35.125,2024.529,null,326,40.625,2845.2840000000001,null,null,null,null,null,null,null,null,null,326,40.625,2010.499,null,null,null,null,null,null,null,null,null,null,null,null,null,null,null,null,null,null,null,35.125]
[35.25,2140.9780000000001,35.25,2024.529,null,327,40.75,2806,null,null,null,null,null,null,null,null,null,327,40.75,2010.499,null,null,null,null,null,null,null,null,null,null,null,null,null,null,null,null,null,null,null,35.25]
[35.375,2156.4110000000001,35.375,2024.529,null,328,40.875,2784.9549999999999,null,null,null,null,null,null,null,null,null,328,40.875,2010.499,null,null,null,null,null,null,null,null,null,null,null,null,null,null,null,null,null,null,null,35.375]
[35.5,2185.8739999999998,35.5,2024.529,null,329,41,2766.7159999999999,null,null,null,null,null,null,null,null,null,329,41,2024.529,null,null,null,null,null,null,null,null,null,null,null,null,null,null,null,null,null,null,null,35.5]
[35.625,2215.337,35.625,2010.499,null,330,41.125,2727.4319999999998,null,null,null,null,null,null,null,null,null,330,41.125,2024.529,null,null,null,null,null,null,null,null,null,null,null,null,null,null,null,null,null,null,null,35.625]
[35.75,2232.1729999999998,35.75,2024.529,null,331,41.25,2690.9540000000002,null,null,null,null,null,null,null,null,null,331,41.25,2024.529,null,null,null,null,null,null,null,null,null,null,null,null,null,null,null,null,null,null,null,35.75]
[35.875,2263.0390000000002,35.875,2024.529,null,332,41.375,2654.4760000000001,null,null,null,null,null,null,null,null,null,332,41.375,2010.499,null,null,null,null,null,null,null,null,null,null,null,null,null,null,null,null,null,null,null,35.875]
[36,2279.875,36,2024.529,null,333,41.5,2636.2370000000001,null,null,null,null,null,null,null,null,null,333,41.5,2024.529,null,null,null,null,null,null,null,null,null,null,null,null,null,null,null,null,null,null,null,36]
[36.125,2310.741,36.125,2024.529,null,334,41.625,2598.3560000000002,null,null,null,null,null,null,null,null,null,334,41.625,2010.499,null,null,null,null,null,null,null,null,null,null,null,null,null,null,null,null,null,null,null,36.125]
[36.25,2343.0100000000002,36.25,2024.529,null,335,41.75,2564.6840000000002,null,null,null,null,null,null,null,null,null,335,41.75,2024.529,null,null,null,null,null,null,null,null,null,null,null,null,null,null,null,null,null,null,null,36.25]
[36.375,2358.4430000000002,36.375,2010.499,null,336,41.875,2545.0419999999999,null,null,null,null,null,null,null,null,null,336,41.875,2010.499,null,null,null,null,null,null,null,null,null,null,null,null,null,null,null,null,null,null,null,36.375]
[36.5,2408.951,36.5,2010.499,null,337,42,2509.9670000000001,null,null,null,null,null,null,null,null,null,337,42,2024.529,null,null,null,null,null,null,null,null,null,null,null,null,null,null,null,null,null,null,null,36.5]
[36.625,2442.623,36.625,2010.499,null,338,42.125,2476.2950000000001,null,null,null,null,null,null,null,null,null,338,42.125,1996.4690000000001,null,null,null,null,null,null,null,null,null,null,null,null,null,null,null,null,null,null,null,36.625]
[36.75,2459.4589999999998,36.75,2010.499,null,339,42.25,2442.623,null,null,null,null,null,null,null,null,null,339,42.25,2024.529,null,null,null,null,null,null,null,null,null,null,null,null,null,null,null,null,null,null,null,36.75]
[36.875,2493.1309999999999,36.875,2024.529,null,340,42.375,2408.951,null,null,null,null,null,null,null,null,null,340,42.375,2010.499,null,null,null,null,null,null,null,null,null,null,null,null,null,null,null,null,null,null,null,36.875]
[37,2509.9670000000001,37,2010.499,null,341,42.5,2375.279,null,null,null,null,null,null,null,null,null,341,42.5,2010.499,null,null,null,null,null,null,null,null,null,null,null,null,null,null,null,null,null,null,null,37]
[37.125,2564.6840000000002,37.125,2010.499,null,{"$f":"F601+1","v":342},42.625,2358.4430000000002,null,null,null,null,null,null,null,null,null,342,42.625,2010.499,null,null,null,null,null,null,null,null,null,null,null,null,null,null,null,null,null,null,null,37.125]
[37.25,2564.6840000000002,37.25,2010.499,null,343,42.75,2327.5770000000002,null,null,null,null,null,null,null,null,null,343,42.75,2010.499,null,null,null,null,null,null,null,null,null,null,null,null,null,null,null,null,null,null,null,37.25]
[37.375,2598.3560000000002,37.375,2024.529,null,344,42.875,2295.308,null,null,null,null,null,null,null,null,null,344,42.875,2010.499,null,null,null,null,null,null,null,null,null,null,null,null,null,null,null,null,null,null,null,37.375]
[37.5,2617.998,37.5,2010.499,null,345,43,2279.875,null,null,null,null,null,null,null,null,null,345,43,2010.499,null,null,null,null,null,null,null,null,null,null,null,null,null,null,null,null,null,null,null,37.5]
[37.625,2654.4760000000001,37.625,2024.529,null,346,43.125,2247.6060000000002,null,null,null,null,null,null,null,null,null,346,43.125,2010.499,null,null,null,null,null,null,null,null,null,null,null,null,null,null,null,null,null,null,null,37.625]
[37.75,2672.7150000000001,37.75,2024.529,null,347,43.25,2215.337,null,null,null,null,null,null,null,null,null,347,43.25,2010.499,null,null,null,null,null,null,null,null,null,null,null,null,null,null,null,null,null,null,null,37.75]
[37.875,2690.9540000000002,37.875,2024.529,null,348,43.375,2185.8739999999998,null,null,null,null,null,null,null,null,null,348,43.375,2024.529,null,null,null,null,null,null,null,null,null,null,null,null,null,null,null,null,null,null,null,37.875]
[38,2709.1930000000002,38,2010.499,null,349,43.5,2156.4110000000001,null,null,null,null,null,null,null,null,null,349,43.5,2024.529,null,null,null,null,null,null,null,null,null,null,null,null,null,null,null,null,null,null,null,38]
[38.125,2727.4319999999998,38.125,2010.499,null,350,43.625,2140.9780000000001,null,null,null,null,null,null,null,null,null,350,43.625,2010.499,null,null,null,null,null,null,null,null,null,null,null,null,null,null,null,null,null,null,null,38.125]
[38.25,2784.9549999999999,38.25,2010.499,null,351,43.75,2126.9479999999999,null,null,null,null,null,null,null,null,null,351,43.75,2010.499,null,null,null,null,null,null,null,null,null,null,null,null,null,null,null,null,null,null,null,38.25]
[38.375,2784.9549999999999,38.375,2010.499,null,352,43.875,2096.0819999999999,null,null,null,null,null,null,null,null,null,352,43.875,2024.529,null,null,null,null,null,null,null,null,null,null,null,null,null,null,null,null,null,null,null,38.375]
[38.5,2806,38.5,2024.529,null,353,44,2096.0819999999999,null,null,null,null,null,null,null,null,null,353,44,2024.529,null,null,null,null,null,null,null,null,null,null,null,null,null,null,null,null,null,null,null,38.5]
[38.625,2825.6419999999998,38.625,2010.499,null,354,44.125,2082.0520000000001,null,null,null,null,null,null,null,null,null,354,44.125,2010.499,null,null,null,null,null,null,null,null,null,null,null,null,null,null,null,null,null,null,null,38.625]
[38.75,2864.9259999999999,38.75,2024.529,null,355,44.25,2082.0520000000001,null,null,null,null,null,null,null,null,null,355,44.25,2010.499,null,null,null,null,null,null,null,null,null,null,null,null,null,null,null,null,null,null,null,38.75]
[38.875,2864.9259999999999,38.875,2024.529,null,356,44.375,2082.0520000000001,null,null,null,null,null,null,null,null,null,356,44.375,2010.499,null,null,null,null,null,null,null,null,null,null,null,null,null,null,null,null,null,null,null,38.875]
[39,2884.5680000000002,39,2024.529,null,357,44.5,2082.0520000000001,null,null,null,null,null,null,null,null,null,357,44.5,2024.529,null,null,null,null,null,null,null,null,null,null,null,null,null,null,null,null,null,null,null,39]
[39.125,2884.5680000000002,39.125,2024.529,null,358,44.625,2082.0520000000001,null,null,null,null,null,null,null,null,null,358,44.625,1996.4690000000001,null,null,null,null,null,null,null,null,null,null,null,null,null,null,null,null,null,null,null,39.125]
[39.25,2904.21,39.25,2010.499,null,359,44.75,2096.0819999999999,null,null,null,null,null,null,null,null,null,359,44.75,2010.499,null,null,null,null,null,null,null,null,null,null,null,null,null,null,null,null,null,null,null,39.25]
[39.375,2923.8519999999999,39.375,2010.499,null,360,44.875,2110.1120000000001,null,null,null,null,null,null,null,null,null,360,44.875,2010.499,null,null,null,null,null,null,null,null,null,null,null,null,null,null,null,null,null,null,null,39.375]
[39.5,2904.21,39.5,2024.529,null,361,45,2110.1120000000001,null,null,null,null,null,null,null,null,null,361,45,2010.499,null,null,null,null,null,null,null,null,null,null,null,null,null,null,null,null,null,null,null,39.5]
[39.625,2923.8519999999999,39.625,2010.499,null,362,45.125,2126.9479999999999,null,null,null,null,null,null,null,null,null,362,45.125,2010.499,null,null,null,null,null,null,null,null,null,null,null,null,null,null,null,null,null,null,null,39.625]
[39.75,2904.21,39.75,2024.529,null,363,45.25,2140.9780000000001,null,null,null,null,null,null,null,null,null,363,45.25,2010.499,null,null,null,null,null,null,null,null,null,null,null,null,null,null,null,null,null,null,null,39.75]
[39.875,2923.8519999999999,39.875,2024.529,null,364,45.375,2170.4409999999998,null,null,null,null,null,null,null,null,null,364,45.375,2010.499,null,null,null,null,null,null,null,null,null,null,null,null,null,null,null,null,null,null,null,39.875]
[40,2904.21,40,2010.499,null,365,45.5,2185.8739999999998,null,null,null,null,null,null,null,null,null,365,45.5,2024.529,null,null,null,null,null,null,null,null,null,null,null,null,null,null,null,null,null,null,null,40]
[40.125,2904.21,40.125,2024.529,null,366,45.625,2215.337,null,null,null,null,null,null,null,null,null,366,45.625,2024.529,null,null,null,null,null,null,null,null,null,null,null,null,null,null,null,null,null,null,null,40.125]
[40.25,2884.5680000000002,40.25,2024.529,null,367,45.75,2232.1729999999998,null,null,null,null,null,null,null,null,null,367,45.75,2010.499,null,null,null,null,null,null,null,null,null,null,null,null,null,null,null,null,null,null,null,40.25]
[40.375,2884.5680000000002,40.375,2010.499,null,368,45.875,2263.0390000000002,null,null,null,null,null,null,null,null,null,368,45.875,2010.499,null,null,null,null,null,null,null,null,null,null,null,null,null,null,null,null,null,null,null,40.375]
[40.5,2864.9259999999999,40.5,2010.499,null,369,46,2279.875,null,null,null,null,null,null,null,null,null,369,46,2010.499,null,null,null,null,null,null,null,null,null,null,null,null,null,null,null,null,null,null,null,40.5]
[40.625,2845.2840000000001,40.625,2010.499,null,370,46.125,2310.741,null,null,null,null,null,null,null,null,null,370,46.125,2024.529,null,null,null,null,null,null,null,null,null,null,null,null,null,null,null,null,null,null,null,40.625]
[40.75,2806,40.75,2010.499,null,371,46.25,2343.0100000000002,null,null,null,null,null,null,null,null,null,371,46.25,2010.499,null,null,null,null,null,null,null,null,null,null,null,null,null,null,null,null,null,null,null,40.75]
[40.875,2784.9549999999999,40.875,2010.499,null,372,46.375,2358.4430000000002,null,null,null,null,null,null,null,null,null,372,46.375,2010.499,null,null,null,null,null,null,null,null,null,null,null,null,null,null,null,null,null,null,null,40.875]
[41,2766.7159999999999,41,2024.529,null,373,46.5,2408.951,null,null,null,null,null,null,null,null,null,373,46.5,2010.499,null,null,null,null,null,null,null,null,null,null,null,null,null,null,null,null,null,null,null,41]
[41.125,2727.4319999999998,41.125,2024.529,null,374,46.625,2425.7869999999998,null,null,null,null,null,null,null,null,null,374,46.625,2010.499,null,null,null,null,null,null,null,null,null,null,null,null,null,null,null,null,null,null,null,41.125]
[41.25,2690.9540000000002,41.25,2024.529,null,375,46.75,2459.4589999999998,null,null,null,null,null,null,null,null,null,375,46.75,2010.499,null,null,null,null,null,null,null,null,null,null,null,null,null,null,null,null,null,null,null,41.25]
[41.375,2654.4760000000001,41.375,2010.499,null,376,46.875,2476.2950000000001,null,null,null,null,null,null,null,null,null,376,46.875,2024.529,null,null,null,null,null,null,null,null,null,null,null,null,null,null,null,null,null,null,null,41.375]
[41.5,2636.2370000000001,41.5,2024.529,null,377,47,2509.9670000000001,null,null,null,null,null,null,null,null,null,377,47,2010.499,null,null,null,null,null,null,null,null,null,null,null,null,null,null,null,null,null,null,null,41.5]
[41.625,2598.3560000000002,41.625,2010.499,null,378,47.125,2526.8029999999999,null,null,null,null,null,null,null,null,null,378,47.125,2024.529,null,null,null,null,null,null,null,null,null,null,null,null,null,null,null,null,null,null,null,41.625]
[41.75,2564.6840000000002,41.75,2024.529,null,379,47.25,2564.6840000000002,null,null,null,null,null,null,null,null,null,379,47.25,2024.529,null,null,null,null,null,null,null,null,null,null,null,null,null,null,null,null,null,null,null,41.75]
[41.875,2545.0419999999999,41.875,2010.499,null,380,47.375,2581.52,null,null,null,null,null,null,null,null,null,380,47.375,2010.499,null,null,null,null,null,null,null,null,null,null,null,null,null,null,null,null,null,null,null,41.875]
[42,2509.9670000000001,42,2024.529,null,381,47.5,2636.2370000000001,null,null,null,null,null,null,null,null,null,381,47.5,2010.499,null,null,null,null,null,null,null,null,null,null,null,null,null,null,null,null,null,null,null,42]
[42.125,2476.2950000000001,42.125,1996.4690000000001,null,382,47.625,2636.2370000000001,null,null,null,null,null,null,null,null,null,382,47.625,2010.499,null,null,null,null,null,null,null,null,null,null,null,null,null,null,null,null,null,null,null,42.125]
[42.25,2442.623,42.25,2024.529,null,383,47.75,2672.7150000000001,null,null,null,null,null,null,null,null,null,383,47.75,2024.529,null,null,null,null,null,null,null,null,null,null,null,null,null,null,null,null,null,null,null,42.25]
[42.375,2408.951,42.375,2010.499,null,384,47.875,2690.9540000000002,null,null,null,null,null,null,null,null,null,384,47.875,2010.499,null,null,null,null,null,null,null,null,null,null,null,null,null,null,null,null,null,null,null,42.375]
[42.5,2375.279,42.5,2010.499,null,385,48,2709.1930000000002,null,null,null,null,null,null,null,null,null,385,48,2010.499,null,null,null,null,null,null,null,null,null,null,null,null,null,null,null,null,null,null,null,42.5]
[42.625,2358.4430000000002,42.625,2010.499,null,386,{"$f":"INDEX($A$200:$A$1200,MATCH(\"t in*\",$A$200:$A$1200,0)+F646)","v":48.125},{"$f":"INDEX($B$200:$B$1200,MATCH(\"t in*\",$A$200:$A$1200,0)+F646)","v":2748.4769999999999},null,null,null,null,null,null,null,null,null,386,{"$f":"INDEX($C$1:$C$1200,MATCH(\"t in*\",$C$1:$C$1200,0)+R646)","v":48.125},{"$f":"INDEX($D$1:$D$1200,MATCH(\"t in*\",$C$1:$C$1200,0)+R646)","v":2024.529},null,null,null,null,null,null,null,null,null,null,null,null,null,null,null,null,null,null,null,42.625]
[42.75,2327.5770000000002,42.75,2010.499,null,387,48.25,2766.7159999999999,null,null,null,null,null,null,null,null,null,{"$f":"R646+1","v":387},48.25,2024.529,null,null,null,null,null,null,null,null,null,null,null,null,null,null,null,null,null,null,null,42.75]
[42.875,2295.308,42.875,2010.499,null,388,48.375,2784.9549999999999,null,null,null,null,null,null,null,null,null,388,48.375,2010.499,null,null,null,null,null,null,null,null,null,null,null,null,null,null,null,null,null,null,null,42.875]
[43,2279.875,43,2010.499,null,389,48.5,2806,null,null,null,null,null,null,null,null,null,389,48.5,2024.529,null,null,null,null,null,null,null,null,null,null,null,null,null,null,null,null,null,null,null,43]
[43.125,2247.6060000000002,43.125,2010.499,null,390,48.625,2825.6419999999998,null,null,null,null,null,null,null,null,null,390,48.625,2010.499,null,null,null,null,null,null,null,null,null,null,null,null,null,null,null,null,null,null,null,43.125]
[43.25,2215.337,43.25,2010.499,null,391,48.75,2845.2840000000001,null,null,null,null,null,null,null,null,null,391,48.75,2024.529,null,null,null,null,null,null,null,null,null,null,null,null,null,null,null,null,null,null,null,43.25]
[43.375,2185.8739999999998,43.375,2024.529,null,392,48.875,2864.9259999999999,null,null,null,null,null,null,null,null,null,392,48.875,2024.529,null,null,null,null,null,null,null,null,null,null,null,null,null,null,null,null,null,null,null,43.375]
[43.5,2156.4110000000001,43.5,2024.529,null,393,49,2884.5680000000002,null,null,null,null,null,null,null,null,null,393,49,2024.529,null,null,null,null,null,null,null,null,null,null,null,null,null,null,null,null,null,null,null,43.5]
[43.625,2140.9780000000001,43.625,2010.499,null,394,49.125,2884.5680000000002,null,null,null,null,null,null,null,null,null,394,49.125,2010.499,null,null,null,null,null,null,null,null,null,null,null,null,null,null,null,null,null,null,null,43.625]
[43.75,2126.9479999999999,43.75,2010.499,null,395,49.25,2904.21,null,null,null,null,null,null,null,null,null,395,49.25,2010.499,null,null,null,null,null,null,null,null,null,null,null,null,null,null,null,null,null,null,null,43.75]
[43.875,2096.0819999999999,43.875,2024.529,null,396,49.375,2904.21,null,null,null,null,null,null,null,null,null,396,49.375,2010.499,null,null,null,null,null,null,null,null,null,null,null,null,null,null,null,null,null,null,null,43.875]
[44,2096.0819999999999,44,2024.529,null,397,49.5,2904.21,null,null,null,null,null,null,null,null,null,397,49.5,2024.529,null,null,null,null,null,null,null,null,null,null,null,null,null,null,null,null,null,null,null,44]
[44.125,2082.0520000000001,44.125,2010.499,null,398,49.625,2923.8519999999999,null,null,null,null,null,null,null,null,null,398,49.625,2010.499,null,null,null,null,null,null,null,null,null,null,null,null,null,null,null,null,null,null,null,44.125]
[44.25,2082.0520000000001,44.25,2010.499,null,399,49.75,2904.21,null,null,null,null,null,null,null,null,null,399,49.75,2024.529,null,null,null,null,null,null,null,null,null,null,null,null,null,null,null,null,null,null,null,44.25]
[44.375,2082.0520000000001,44.375,2010.499,null,400,49.875,2904.21,null,null,null,null,null,null,null,null,null,400,49.875,2010.499,null,null,null,null,null,null,null,null,null,null,null,null,null,null,null,null,null,null,null,44.375]
[44.5,2082.0520000000001,44.5,2024.529,null,401,50,2904.21,null,null,null,null,null,null,null,null,null,401,50,2010.499,null,null,null,null,null,null,null,null,null,null,null,null,null,null,null,null,null,null,null,44.5]
[44.625,2082.0520000000001,44.625,1996.4690000000001,null,402,50.125,2884.5680000000002,null,null,null,null,null,null,null,null,null,402,50.125,2010.499,null,null,null,null,null,null,null,null,null,null,null,null,null,null,null,null,null,null,null,44.625]
[44.75,2096.0819999999999,44.75,2010.499,null,403,50.25,2884.5680000000002,null,null,null,null,null,null,null,null,null,403,50.25,2010.499,null,null,null,null,null,null,null,null,null,null,null,null,null,null,null,null,null,null,null,44.75]
[44.875,2110.1120000000001,44.875,2010.499,null,404,50.375,2864.9259999999999,null,null,null,null,null,null,null,null,null,404,50.375,2010.499,null,null,null,null,null,null,null,null,null,null,null,null,null,null,null,null,null,null,null,44.875]
[45,2110.1120000000001,45,2010.499,null,405,50.5,2864.9259999999999,null,null,null,null,null,null,null,null,null,405,50.5,2010.499,null,null,null,null,null,null,null,null,null,null,null,null,null,null,null,null,null,null,null,45]
[45.125,2126.9479999999999,45.125,2010.499,null,{"$f":"F665+1","v":406},50.625,2845.2840000000001,null,null,null,null,null,null,null,null,null,406,50.625,1996.4690000000001,null,null,null,null,null,null,null,null,null,null,null,null,null,null,null,null,null,null,null,45.125]
[45.25,2140.9780000000001,45.25,2010.499,null,407,50.75,2825.6419999999998,null,null,null,null,null,null,null,null,null,407,50.75,2024.529,null,null,null,null,null,null,null,null,null,null,null,null,null,null,null,null,null,null,null,45.25]
[45.375,2170.4409999999998,45.375,2010.499,null,408,50.875,2784.9549999999999,null,null,null,null,null,null,null,null,null,408,50.875,2010.499,null,null,null,null,null,null,null,null,null,null,null,null,null,null,null,null,null,null,null,45.375]
[45.5,2185.8739999999998,45.5,2024.529,null,409,51,2766.7159999999999,null,null,null,null,null,null,null,null,null,409,51,2010.499,null,null,null,null,null,null,null,null,null,null,null,null,null,null,null,null,null,null,null,45.5]
[45.625,2215.337,45.625,2024.529,null,410,51.125,2727.4319999999998,null,null,null,null,null,null,null,null,null,410,51.125,2010.499,null,null,null,null,null,null,null,null,null,null,null,null,null,null,null,null,null,null,null,45.625]
[45.75,2232.1729999999998,45.75,2010.499,null,411,51.25,2690.9540000000002,null,null,null,null,null,null,null,null,null,411,51.25,2024.529,null,null,null,null,null,null,null,null,null,null,null,null,null,null,null,null,null,null,null,45.75]
[45.875,2263.0390000000002,45.875,2010.499,null,412,51.375,2672.7150000000001,null,null,null,null,null,null,null,null,null,412,51.375,2010.499,null,null,null,null,null,null,null,null,null,null,null,null,null,null,null,null,null,null,null,45.875]
[46,2279.875,46,2010.499,null,413,51.5,2636.2370000000001,null,null,null,null,null,null,null,null,null,413,51.5,2010.499,null,null,null,null,null,null,null,null,null,null,null,null,null,null,null,null,null,null,null,46]
[46.125,2310.741,46.125,2024.529,null,414,51.625,2598.3560000000002,null,null,null,null,null,null,null,null,null,414,51.625,2010.499,null,null,null,null,null,null,null,null,null,null,null,null,null,null,null,null,null,null,null,46.125]
[46.25,2343.0100000000002,46.25,2010.499,null,415,51.75,2564.6840000000002,null,null,null,null,null,null,null,null,null,415,51.75,2010.499,null,null,null,null,null,null,null,null,null,null,null,null,null,null,null,null,null,null,null,46.25]
[46.375,2358.4430000000002,46.375,2010.499,null,416,51.875,2526.8029999999999,null,null,null,null,null,null,null,null,null,416,51.875,2010.499,null,null,null,null,null,null,null,null,null,null,null,null,null,null,null,null,null,null,null,46.375]
[46.5,2408.951,46.5,2010.499,null,417,52,2509.9670000000001,null,null,null,null,null,null,null,null,null,417,52,2010.499,null,null,null,null,null,null,null,null,null,null,null,null,null,null,null,null,null,null,null,46.5]
[46.625,2425.7869999999998,46.625,2010.499,null,418,52.125,2493.1309999999999,null,null,null,null,null,null,null,null,null,418,52.125,2010.499,null,null,null,null,null,null,null,null,null,null,null,null,null,null,null,null,null,null,null,46.625]
[46.75,2459.4589999999998,46.75,2010.499,null,419,52.25,2442.623,null,null,null,null,null,null,null,null,null,419,52.25,2010.499,null,null,null,null,null,null,null,null,null,null,null,null,null,null,null,null,null,null,null,46.75]
[46.875,2476.2950000000001,46.875,2024.529,null,420,52.375,2425.7869999999998,null,null,null,null,null,null,null,null,null,420,52.375,2010.499,null,null,null,null,null,null,null,null,null,null,null,null,null,null,null,null,null,null,null,46.875]
[47,2509.9670000000001,47,2010.499,null,421,52.5,2393.518,null,null,null,null,null,null,null,null,null,421,52.5,2024.529,null,null,null,null,null,null,null,null,null,null,null,null,null,null,null,null,null,null,null,47]
[47.125,2526.8029999999999,47.125,2024.529,null,422,52.625,2358.4430000000002,null,null,null,null,null,null,null,null,null,422,52.625,2024.529,null,null,null,null,null,null,null,null,null,null,null,null,null,null,null,null,null,null,null,47.125]
[47.25,2564.6840000000002,47.25,2024.529,null,423,52.75,2343.0100000000002,null,null,null,null,null,null,null,null,null,423,52.75,2010.499,null,null,null,null,null,null,null,null,null,null,null,null,null,null,null,null,null,null,null,47.25]
[47.375,2581.52,47.375,2010.499,null,424,52.875,2295.308,null,null,null,null,null,null,null,null,null,424,52.875,2010.499,null,null,null,null,null,null,null,null,null,null,null,null,null,null,null,null,null,null,null,47.375]
[47.5,2636.2370000000001,47.5,2010.499,null,425,53,2279.875,null,null,null,null,null,null,null,null,null,425,53,2010.499,null,null,null,null,null,null,null,null,null,null,null,null,null,null,null,null,null,null,null,47.5]
[47.625,2636.2370000000001,47.625,2010.499,null,426,53.125,2247.6060000000002,null,null,null,null,null,null,null,null,null,426,53.125,2010.499,null,null,null,null,null,null,null,null,null,null,null,null,null,null,null,null,null,null,null,47.625]
[47.75,2672.7150000000001,47.75,2024.529,null,427,53.25,2215.337,null,null,null,null,null,null,null,null,null,427,53.25,2010.499,null,null,null,null,null,null,null,null,null,null,null,null,null,null,null,null,null,null,null,47.75]
[47.875,2690.9540000000002,47.875,2010.499,null,428,53.375,2185.8739999999998,null,null,null,null,null,null,null,null,null,428,53.375,2010.499,null,null,null,null,null,null,null,null,null,null,null,null,null,null,null,null,null,null,null,47.875]
[48,2709.1930000000002,48,2010.499,null,429,53.5,2156.4110000000001,null,null,null,null,null,null,null,null,null,429,53.5,2024.529,null,null,null,null,null,null,null,null,null,null,null,null,null,null,null,null,null,null,null,48]
[48.125,2748.4769999999999,48.125,2024.529,null,430,53.625,2140.9780000000001,null,null,null,null,null,null,null,null,null,430,53.625,2010.499,null,null,null,null,null,null,null,null,null,null,null,null,null,null,null,null,null,null,null,48.125]
[48.25,2766.7159999999999,48.25,2024.529,null,431,53.75,2110.1120000000001,null,null,null,null,null,null,null,null,null,431,53.75,2010.499,null,null,null,null,null,null,null,null,null,null,null,null,null,null,null,null,null,null,null,48.25]
[48.375,2784.9549999999999,48.375,2010.499,null,432,53.875,2110.1120000000001,null,null,null,null,null,null,null,null,null,432,53.875,2010.499,null,null,null,null,null,null,null,null,null,null,null,null,null,null,null,null,null,null,null,48.375]
[48.5,2806,48.5,2024.529,null,433,54,2096.0819999999999,null,null,null,null,null,null,null,null,null,433,54,2010.499,null,null,null,null,null,null,null,null,null,null,null,null,null,null,null,null,null,null,null,48.5]
[48.625,2825.6419999999998,48.625,2010.499,null,434,54.125,2082.0520000000001,null,null,null,null,null,null,null,null,null,434,54.125,2010.499,null,null,null,null,null,null,null,null,null,null,null,null,null,null,null,null,null,null,null,48.625]
[48.75,2845.2840000000001,48.75,2024.529,null,435,54.25,2082.0520000000001,null,null,null,null,null,null,null,null,null,435,54.25,2010.499,null,null,null,null,null,null,null,null,null,null,null,null,null,null,null,null,null,null,null,48.75]
[48.875,2864.9259999999999,48.875,2024.529,null,436,54.375,2082.0520000000001,null,null,null,null,null,null,null,null,null,436,54.375,2010.499,null,null,null,null,null,null,null,null,null,null,null,null,null,null,null,null,null,null,null,48.875]
[49,2884.5680000000002,49,2024.529,null,437,54.5,2066.6190000000001,null,null,null,null,null,null,null,null,null,437,54.5,2010.499,null,null,null,null,null,null,null,null,null,null,null,null,null,null,null,null,null,null,null,49]
[49.125,2884.5680000000002,49.125,2010.499,null,438,54.625,2082.0520000000001,null,null,null,null,null,null,null,null,null,438,54.625,2024.529,null,null,null,null,null,null,null,null,null,null,null,null,null,null,null,null,null,null,null,49.125]
[49.25,2904.21,49.25,2010.499,null,439,54.75,2082.0520000000001,null,null,null,null,null,null,null,null,null,439,54.75,2010.499,null,null,null,null,null,null,null,null,null,null,null,null,null,null,null,null,null,null,null,49.25]
[49.375,2904.21,49.375,2010.499,null,440,54.875,2096.0819999999999,null,null,null,null,null,null,null,null,null,440,54.875,2010.499,null,null,null,null,null,null,null,null,null,null,null,null,null,null,null,null,null,null,null,49.375]
[49.5,2904.21,49.5,2024.529,null,441,55,2110.1120000000001,null,null,null,null,null,null,null,null,null,441,55,1996.4690000000001,null,null,null,null,null,null,null,null,null,null,null,null,null,null,null,null,null,null,null,49.5]
[49.625,2923.8519999999999,49.625,2010.499,null,442,55.125,2126.9479999999999,null,null,null,null,null,null,null,null,null,442,55.125,2024.529,null,null,null,null,null,null,null,null,null,null,null,null,null,null,null,null,null,null,null,49.625]
[49.75,2904.21,49.75,2024.529,null,443,55.25,2140.9780000000001,null,null,null,null,null,null,null,null,null,443,55.25,2010.499,null,null,null,null,null,null,null,null,null,null,null,null,null,null,null,null,null,null,null,49.75]
[49.875,2904.21,49.875,2010.499,null,444,55.375,2170.4409999999998,null,null,null,null,null,null,null,null,null,444,55.375,2010.499,null,null,null,null,null,null,null,null,null,null,null,null,null,null,null,null,null,null,null,49.875]
[50,2904.21,50,2010.499,null,445,55.5,2185.8739999999998,null,null,null,null,null,null,null,null,null,445,55.5,2010.499,null,null,null,null,null,null,null,null,null,null,null,null,null,null,null,null,null,null,null,50]
[50.125,2884.5680000000002,50.125,2010.499,null,446,55.625,2201.3069999999998,null,null,null,null,null,null,null,null,null,446,55.625,2010.499,null,null,null,null,null,null,null,null,null,null,null,null,null,null,null,null,null,null,null,50.125]
[50.25,2884.5680000000002,50.25,2010.499,null,447,55.75,2215.337,null,null,null,null,null,null,null,null,null,447,55.75,2010.499,null,null,null,null,null,null,null,null,null,null,null,null,null,null,null,null,null,null,null,50.25]
[50.375,2864.9259999999999,50.375,2010.499,null,448,55.875,2247.6060000000002,null,null,null,null,null,null,null,null,null,448,55.875,2010.499,null,null,null,null,null,null,null,null,null,null,null,null,null,null,null,null,null,null,null,50.375]
[50.5,2864.9259999999999,50.5,2010.499,null,449,56,2295.308,null,null,null,null,null,null,null,null,null,449,56,2010.499,null,null,null,null,null,null,null,null,null,null,null,null,null,null,null,null,null,null,null,50.5]
[50.625,2845.2840000000001,50.625,1996.4690000000001,null,450,{"$f":"INDEX($A$200:$A$1200,MATCH(\"t in*\",$A$200:$A$1200,0)+F710)","v":56.125},{"$f":"INDEX($B$200:$B$1200,MATCH(\"t in*\",$A$200:$A$1200,0)+F710)","v":2310.741},null,null,null,null,null,null,null,null,null,450,{"$f":"INDEX($C$1:$C$1200,MATCH(\"t in*\",$C$1:$C$1200,0)+R710)","v":56.125},{"$f":"INDEX($D$1:$D$1200,MATCH(\"t in*\",$C$1:$C$1200,0)+R710)","v":1996.4690000000001},null,null,null,null,null,null,null,null,null,null,null,null,null,null,null,null,null,null,null,50.625]
[50.75,2825.6419999999998,50.75,2024.529,null,451,56.25,2343.0100000000002,null,null,null,null,null,null,null,null,null,{"$f":"R710+1","v":451},56.25,2010.499,null,null,null,null,null,null,null,null,null,null,null,null,null,null,null,null,null,null,null,50.75]
[50.875,2784.9549999999999,50.875,2010.499,null,452,56.375,2358.4430000000002,null,null,null,null,null,null,null,null,null,452,56.375,1996.4690000000001,null,null,null,null,null,null,null,null,null,null,null,null,null,null,null,null,null,null,null,50.875]
[51,2766.7159999999999,51,2010.499,null,453,56.5,2408.951,null,null,null,null,null,null,null,null,null,453,56.5,2010.499,null,null,null,null,null,null,null,null,null,null,null,null,null,null,null,null,null,null,null,51]
[51.125,2727.4319999999998,51.125,2010.499,null,454,56.625,2425.7869999999998,null,null,null,null,null,null,null,null,null,454,56.625,2010.499,null,null,null,null,null,null,null,null,null,null,null,null,null,null,null,null,null,null,null,51.125]
[51.25,2690.9540000000002,51.25,2024.529,null,455,56.75,2459.4589999999998,null,null,null,null,null,null,null,null,null,455,56.75,2024.529,null,null,null,null,null,null,null,null,null,null,null,null,null,null,null,null,null,null,null,51.25]
[51.375,2672.7150000000001,51.375,2010.499,null,456,56.875,2476.2950000000001,null,null,null,null,null,null,null,null,null,456,56.875,2010.499,null,null,null,null,null,null,null,null,null,null,null,null,null,null,null,null,null,null,null,51.375]
[51.5,2636.2370000000001,51.5,2010.499,null,457,57,2509.9670000000001,null,null,null,null,null,null,null,null,null,457,57,2010.499,null,null,null,null,null,null,null,null,null,null,null,null,null,null,null,null,null,null,null,51.5]
[51.625,2598.3560000000002,51.625,2010.499,null,458,57.125,2526.8029999999999,null,null,null,null,null,null,null,null,null,458,57.125,2010.499,null,null,null,null,null,null,null,null,null,null,null,null,null,null,null,null,null,null,null,51.625]
[51.75,2564.6840000000002,51.75,2010.499,null,459,57.25,2564.6840000000002,null,null,null,null,null,null,null,null,null,459,57.25,2024.529,null,null,null,null,null,null,null,null,null,null,null,null,null,null,null,null,null,null,null,51.75]
[51.875,2526.8029999999999,51.875,2010.499,null,460,57.375,2581.52,null,null,null,null,null,null,null,null,null,460,57.375,2024.529,null,null,null,null,null,null,null,null,null,null,null,null,null,null,null,null,null,null,null,51.875]
[52,2509.9670000000001,52,2010.499,null,461,57.5,2617.998,null,null,null,null,null,null,null,null,null,461,57.5,2010.499,null,null,null,null,null,null,null,null,null,null,null,null,null,null,null,null,null,null,null,52]
[52.125,2493.1309999999999,52.125,2010.499,null,462,57.625,2654.4760000000001,null,null,null,null,null,null,null,null,null,462,57.625,2010.499,null,null,null,null,null,null,null,null,null,null,null,null,null,null,null,null,null,null,null,52.125]
[52.25,2442.623,52.25,2010.499,null,463,57.75,2672.7150000000001,null,null,null,null,null,null,null,null,null,463,57.75,2010.499,null,null,null,null,null,null,null,null,null,null,null,null,null,null,null,null,null,null,null,52.25]
[52.375,2425.7869999999998,52.375,2010.499,null,464,57.875,2690.9540000000002,null,null,null,null,null,null,null,null,null,464,57.875,2010.499,null,null,null,null,null,null,null,null,null,null,null,null,null,null,null,null,null,null,null,52.375]
[52.5,2393.518,52.5,2024.529,null,465,58,2709.1930000000002,null,null,null,null,null,null,null,null,null,465,58,2010.499,null,null,null,null,null,null,null,null,null,null,null,null,null,null,null,null,null,null,null,52.5]
[52.625,2358.4430000000002,52.625,2024.529,null,466,58.125,2748.4769999999999,null,null,null,null,null,null,null,null,null,466,58.125,2010.499,null,null,null,null,null,null,null,null,null,null,null,null,null,null,null,null,null,null,null,52.625]
[52.75,2343.0100000000002,52.75,2010.499,null,467,58.25,2766.7159999999999,null,null,null,null,null,null,null,null,null,467,58.25,2010.499,null,null,null,null,null,null,null,null,null,null,null,null,null,null,null,null,null,null,null,52.75]
[52.875,2295.308,52.875,2010.499,null,468,58.375,2784.9549999999999,null,null,null,null,null,null,null,null,null,468,58.375,2010.499,null,null,null,null,null,null,null,null,null,null,null,null,null,null,null,null,null,null,null,52.875]
[53,2279.875,53,2010.499,null,469,58.5,2806,null,null,null,null,null,null,null,null,null,469,58.5,1996.4690000000001,null,null,null,null,null,null,null,null,null,null,null,null,null,null,null,null,null,null,null,53]
[53.125,2247.6060000000002,53.125,2010.499,null,{"$f":"F729+1","v":470},58.625,2825.6419999999998,null,null,null,null,null,null,null,null,null,470,58.625,2010.499,null,null,null,null,null,null,null,null,null,null,null,null,null,null,null,null,null,null,null,53.125]
[53.25,2215.337,53.25,2010.499,null,471,58.75,2845.2840000000001,null,null,null,null,null,null,null,null,null,471,58.75,2010.499,null,null,null,null,null,null,null,null,null,null,null,null,null,null,null,null,null,null,null,53.25]
[53.375,2185.8739999999998,53.375,2010.499,null,472,58.875,2864.9259999999999,null,null,null,null,null,null,null,null,null,472,58.875,2010.499,null,null,null,null,null,null,null,null,null,null,null,null,null,null,null,null,null,null,null,53.375]
[53.5,2156.4110000000001,53.5,2024.529,null,473,59,2864.9259999999999,null,null,null,null,null,null,null,null,null,473,59,2024.529,null,null,null,null,null,null,null,null,null,null,null,null,null,null,null,null,null,null,null,53.5]
[53.625,2140.9780000000001,53.625,2010.499,null,474,59.125,2884.5680000000002,null,null,null,null,null,null,null,null,null,474,59.125,2010.499,null,null,null,null,null,null,null,null,null,null,null,null,null,null,null,null,null,null,null,53.625]
[53.75,2110.1120000000001,53.75,2010.499,null,475,59.25,2904.21,null,null,null,null,null,null,null,null,null,475,59.25,2010.499,null,null,null,null,null,null,null,null,null,null,null,null,null,null,null,null,null,null,null,53.75]
[53.875,2110.1120000000001,53.875,2010.499,null,476,59.375,2904.21,null,null,null,null,null,null,null,null,null,476,59.375,1996.4690000000001,null,null,null,null,null,null,null,null,null,null,null,null,null,null,null,null,null,null,null,53.875]
[54,2096.0819999999999,54,2010.499,null,477,59.5,2904.21,null,null,null,null,null,null,null,null,null,477,59.5,2010.499,null,null,null,null,null,null,null,null,null,null,null,null,null,null,null,null,null,null,null,54]
[54.125,2082.0520000000001,54.125,2010.499,null,478,59.625,2904.21,null,null,null,null,null,null,null,null,null,478,59.625,2010.499,null,null,null,null,null,null,null,null,null,null,null,null,null,null,null,null,null,null,null,54.125]
[54.25,2082.0520000000001,54.25,2010.499,null,479,59.75,2923.8519999999999,null,null,null,null,null,null,null,null,null,479,59.75,2010.499,null,null,null,null,null,null,null,null,null,null,null,null,null,null,null,null,null,null,null,54.25]
[54.375,2082.0520000000001,54.375,2010.499,null,480,59.875,2904.21,null,null,null,null,null,null,null,null,null,480,59.875,2010.499,null,null,null,null,null,null,null,null,null,null,null,null,null,null,null,null,null,null,null,54.375]
[54.5,2066.6190000000001,54.5,2010.499,null,481,60,2904.21,null,null,null,null,null,null,null,null,null,481,60,2024.529,null,null,null,null,null,null,null,null,null,null,null,null,null,null,null,null,null,null,null,54.5]
[54.625,2082.0520000000001,54.625,2024.529,null,482,60.125,2884.5680000000002,null,null,null,null,null,null,null,null,null,482,60.125,2010.499,null,null,null,null,null,null,null,null,null,null,null,null,null,null,null,null,null,null,null,54.625]
[54.75,2082.0520000000001,54.75,2010.499,null,483,60.25,2884.5680000000002,null,null,null,null,null,null,null,null,null,483,60.25,2010.499,null,null,null,null,null,null,null,null,null,null,null,null,null,null,null,null,null,null,null,54.75]
[54.875,2096.0819999999999,54.875,2010.499,null,484,60.375,2884.5680000000002,null,null,null,null,null,null,null,null,null,484,60.375,2010.499,null,null,null,null,null,null,null,null,null,null,null,null,null,null,null,null,null,null,null,54.875]
[55,2110.1120000000001,55,1996.4690000000001,null,485,60.5,2845.2840000000001,null,null,null,null,null,null,null,null,null,485,60.5,2010.499,null,null,null,null,null,null,null,null,null,null,null,null,null,null,null,null,null,null,null,55]
[55.125,2126.9479999999999,55.125,2024.529,null,486,60.625,2845.2840000000001,null,null,null,null,null,null,null,null,null,486,60.625,2024.529,null,null,null,null,null,null,null,null,null,null,null,null,null,null,null,null,null,null,null,55.125]
[55.25,2140.9780000000001,55.25,2010.499,null,487,60.75,2806,null,null,null,null,null,null,null,null,null,487,60.75,1996.4690000000001,null,null,null,null,null,null,null,null,null,null,null,null,null,null,null,null,null,null,null,55.25]
[55.375,2170.4409999999998,55.375,2010.499,null,488,60.875,2784.9549999999999,null,null,null,null,null,null,null,null,null,488,60.875,2010.499,null,null,null,null,null,null,null,null,null,null,null,null,null,null,null,null,null,null,null,55.375]
[55.5,2185.8739999999998,55.5,2010.499,null,489,61,2766.7159999999999,null,null,null,null,null,null,null,null,null,489,61,2010.499,null,null,null,null,null,null,null,null,null,null,null,null,null,null,null,null,null,null,null,55.5]
[55.625,2201.3069999999998,55.625,2010.499,null,490,61.125,2727.4319999999998,null,null,null,null,null,null,null,null,null,490,61.125,2024.529,null,null,null,null,null,null,null,null,null,null,null,null,null,null,null,null,null,null,null,55.625]
[55.75,2215.337,55.75,2010.499,null,491,61.25,2690.9540000000002,null,null,null,null,null,null,null,null,null,491,61.25,2010.499,null,null,null,null,null,null,null,null,null,null,null,null,null,null,null,null,null,null,null,55.75]
[55.875,2247.6060000000002,55.875,2010.499,null,492,61.375,2672.7150000000001,null,null,null,null,null,null,null,null,null,492,61.375,1996.4690000000001,null,null,null,null,null,null,null,null,null,null,null,null,null,null,null,null,null,null,null,55.875]
[56,2295.308,56,2010.499,null,493,61.5,2636.2370000000001,null,null,null,null,null,null,null,null,null,493,61.5,2010.499,null,null,null,null,null,null,null,null,null,null,null,null,null,null,null,null,null,null,null,56]
[56.125,2310.741,56.125,1996.4690000000001,null,494,61.625,2598.3560000000002,null,null,null,null,null,null,null,null,null,494,61.625,2010.499,null,null,null,null,null,null,null,null,null,null,null,null,null,null,null,null,null,null,null,56.125]
[56.25,2343.0100000000002,56.25,2010.499,null,495,61.75,2564.6840000000002,null,null,null,null,null,null,null,null,null,495,61.75,2010.499,null,null,null,null,null,null,null,null,null,null,null,null,null,null,null,null,null,null,null,56.25]
[56.375,2358.4430000000002,56.375,1996.4690000000001,null,496,61.875,2526.8029999999999,null,null,null,null,null,null,null,null,null,496,61.875,2010.499,null,null,null,null,null,null,null,null,null,null,null,null,null,null,null,null,null,null,null,56.375]
[56.5,2408.951,56.5,2010.499,null,497,62,2509.9670000000001,null,null,null,null,null,null,null,null,null,497,62,2010.499,null,null,null,null,null,null,null,null,null,null,null,null,null,null,null,null,null,null,null,56.5]
[56.625,2425.7869999999998,56.625,2010.499,null,498,62.125,2476.2950000000001,null,null,null,null,null,null,null,null,null,498,62.125,2010.499,null,null,null,null,null,null,null,null,null,null,null,null,null,null,null,null,null,null,null,56.625]
[56.75,2459.4589999999998,56.75,2024.529,null,499,62.25,2442.623,null,null,null,null,null,null,null,null,null,499,62.25,2024.529,null,null,null,null,null,null,null,null,null,null,null,null,null,null,null,null,null,null,null,56.75]
[56.875,2476.2950000000001,56.875,2010.499,null,500,62.375,2408.951,null,null,null,null,null,null,null,null,null,500,62.375,2010.499,null,null,null,null,null,null,null,null,null,null,null,null,null,null,null,null,null,null,null,56.875]
[57,2509.9670000000001,57,2010.499,null,501,62.5,2408.951,null,null,null,null,null,null,null,null,null,501,62.5,2010.499,null,null,null,null,null,null,null,null,null,null,null,null,null,null,null,null,null,null,null,57]
[57.125,2526.8029999999999,57.125,2010.499,null,502,62.625,2358.4430000000002,null,null,null,null,null,null,null,null,null,502,62.625,2010.499,null,null,null,null,null,null,null,null,null,null,null,null,null,null,null,null,null,null,null,57.125]
[57.25,2564.6840000000002,57.25,2024.529,null,503,62.75,2327.5770000000002,null,null,null,null,null,null,null,null,null,503,62.75,2010.499,null,null,null,null,null,null,null,null,null,null,null,null,null,null,null,null,null,null,null,57.25]
[57.375,2581.52,57.375,2024.529,null,504,62.875,2295.308,null,null,null,null,null,null,null,null,null,504,62.875,2010.499,null,null,null,null,null,null,null,null,null,null,null,null,null,null,null,null,null,null,null,57.375]
[57.5,2617.998,57.5,2010.499,null,505,63,2279.875,null,null,null,null,null,null,null,null,null,505,63,2024.529,null,null,null,null,null,null,null,null,null,null,null,null,null,null,null,null,null,null,null,57.5]
[57.625,2654.4760000000001,57.625,2010.499,null,506,63.125,2247.6060000000002,null,null,null,null,null,null,null,null,null,506,63.125,2010.499,null,null,null,null,null,null,null,null,null,null,null,null,null,null,null,null,null,null,null,57.625]
[57.75,2672.7150000000001,57.75,2010.499,null,507,63.25,2201.3069999999998,null,null,null,null,null,null,null,null,null,507,63.25,2010.499,null,null,null,null,null,null,null,null,null,null,null,null,null,null,null,null,null,null,null,57.75]
[57.875,2690.9540000000002,57.875,2010.499,null,508,63.375,2185.8739999999998,null,null,null,null,null,null,null,null,null,508,63.375,2024.529,null,null,null,null,null,null,null,null,null,null,null,null,null,null,null,null,null,null,null,57.875]
[58,2709.1930000000002,58,2010.499,null,509,63.5,2156.4110000000001,null,null,null,null,null,null,null,null,null,509,63.5,2010.499,null,null,null,null,null,null,null,null,null,null,null,null,null,null,null,null,null,null,null,58]
[58.125,2748.4769999999999,58.125,2010.499,null,510,63.625,2140.9780000000001,null,null,null,null,null,null,null,null,null,510,63.625,2010.499,null,null,null,null,null,null,null,null,null,null,null,null,null,null,null,null,null,null,null,58.125]
[58.25,2766.7159999999999,58.25,2010.499,null,511,63.75,2110.1120000000001,null,null,null,null,null,null,null,null,null,511,63.75,2010.499,null,null,null,null,null,null,null,null,null,null,null,null,null,null,null,null,null,null,null,58.25]
[58.375,2784.9549999999999,58.375,2010.499,null,512,63.875,2110.1120000000001,null,null,null,null,null,null,null,null,null,512,63.875,2024.529,null,null,null,null,null,null,null,null,null,null,null,null,null,null,null,null,null,null,null,58.375]
[58.5,2806,58.5,1996.4690000000001,null,null,null,null,null,null,null,null,null,null,null,null,null,null,null,null,null,null,null,null,null,null,null,null,null,null,null,null,null,null,null,null,null,null,null,58.5]
[58.625,2825.6419999999998,58.625,2010.499,null,null,null,null,null,null,null,null,null,null,null,null,null,null,null,null,null,null,null,null,null,null,null,null,null,null,null,null,null,null,null,null,null,null,null,58.625]
[58.75,2845.2840000000001,58.75,2010.499,null,null,null,null,null,null,null,null,null,null,null,null,null,null,null,null,null,null,null,null,null,null,null,null,null,null,null,null,null,null,null,null,null,null,null,58.75]
[58.875,2864.9259999999999,58.875,2010.499,null,null,null,null,null,null,null,null,null,null,null,null,null,null,null,null,null,null,null,null,null,null,null,null,null,null,null,null,null,null,null,null,null,null,null,58.875]
[59,2864.9259999999999,59,2024.529,null,null,null,null,null,null,null,null,null,null,null,null,null,null,null,null,null,null,null,null,null,null,null,null,null,null,null,null,null,null,null,null,null,null,null,59]
[59.125,2884.5680000000002,59.125,2010.499,null,null,null,null,null,null,null,null,null,null,null,null,null,null,null,null,null,null,null,null,null,null,null,null,null,null,null,null,null,null,null,null,null,null,null,59.125]
[59.25,2904.21,59.25,2010.499,null,null,null,null,null,null,null,null,null,null,null,null,null,null,null,null,null,null,null,null,null,null,null,null,null,null,null,null,null,null,null,null,null,null,null,59.25]
[59.375,2904.21,59.375,1996.4690000000001,null,null,null,null,null,null,null,null,null,null,null,null,null,null,null,null,null,null,null,null,null,null,null,null,null,null,null,null,null,null,null,null,null,null,null,59.375]
[59.5,2904.21,59.5,2010.499,null,null,null,null,null,null,null,null,null,null,null,null,null,null,null,null,null,null,null,null,null,null,null,null,null,null,null,null,null,null,null,null,null,null,null,59.5]
[59.625,2904.21,59.625,2010.499,null,null,null,null,null,null,null,null,null,null,null,null,null,null,null,null,null,null,null,null,null,null,null,null,null,null,null,null,null,null,null,null,null,null,null,59.625]
[59.75,2923.8519999999999,59.75,2010.499,null,null,null,null,null,null,null,null,null,null,null,null,null,null,null,null,null,null,null,null,null,null,null,null,null,null,null,null,null,null,null,null,null,null,null,59.75]
[59.875,2904.21,59.875,2010.499,null,null,null,null,null,null,null,null,null,null,null,null,null,null,null,null,null,null,null,null,null,null,null,null,null,null,null,null,null,null,null,null,null,null,null,59.875]
[60,2904.21,60,2024.529,null,null,null,null,null,null,null,null,null,null,null,null,null,null,null,null,null,null,null,null,null,null,null,null,null,null,null,null,null,null,null,null,null,null,null,60]
[60.125,2884.5680000000002,60.125,2010.499,null,null,null,null,null,null,null,null,null,null,null,null,null,null,null,null,null,null,null,null,null,null,null,null,null,null,null,null,null,null,null,null,null,null,null,60.125]
[60.25,2884.5680000000002,60.25,2010.499,null,null,null,null,null,null,null,null,null,null,null,null,null,null,null,null,null,null,null,null,null,null,null,null,null,null,null,null,null,null,null,null,null,null,null,60.25]
[60.375,2884.5680000000002,60.375,2010.499,null,null,null,null,null,null,null,null,null,null,null,null,null,null,null,null,null,null,null,null,null,null,null,null,null,null,null,null,null,null,null,null,null,null,null,60.375]
[60.5,2845.2840000000001,60.5,2010.499,null,null,null,null,null,null,null,null,null,null,null,null,null,null,null,null,null,null,null,null,null,null,null,null,null,null,null,null,null,null,null,null,null,null,null,60.5]
[60.625,2845.2840000000001,60.625,2024.529,null,null,null,null,null,null,null,null,null,null,null,null,null,null,null,null,null,null,null,null,null,null,null,null,null,null,null,null,null,null,null,null,null,null,null,60.625]
[60.75,2806,60.75,1996.4690000000001,null,null,null,null,null,null,null,null,null,null,null,null,null,null,null,null,null,null,null,null,null,null,null,null,null,null,null,null,null,null,null,null,null,null,null,60.75]
[60.875,2784.9549999999999,60.875,2010.499,null,null,null,null,null,null,null,null,null,null,null,null,null,null,null,null,null,null,null,null,null,null,null,null,null,null,null,null,null,null,null,null,null,null,null,60.875]
[61,2766.7159999999999,61,2010.499,null,null,null,null,null,null,null,null,null,null,null,null,null,null,null,null,null,null,null,null,null,null,null,null,null,null,null,null,null,null,null,null,null,null,null,61]
[61.125,2727.4319999999998,61.125,2024.529,null,null,null,null,null,null,null,null,null,null,null,null,null,null,null,null,null,null,null,null,null,null,null,null,null,null,null,null,null,null,null,null,null,null,null,61.125]
[61.25,2690.9540000000002,61.25,2010.499,null,null,null,null,null,null,null,null,null,null,null,null,null,null,null,null,null,null,null,null,null,null,null,null,null,null,null,null,null,null,null,null,null,null,null,61.25]
[61.375,2672.7150000000001,61.375,1996.4690000000001,null,null,null,null,null,null,null,null,null,null,null,null,null,null,null,null,null,null,null,null,null,null,null,null,null,null,null,null,null,null,null,null,null,null,null,61.375]
[61.5,2636.2370000000001,61.5,2010.499,null,null,null,null,null,null,null,null,null,null,null,null,null,null,null,null,null,null,null,null,null,null,null,null,null,null,null,null,null,null,null,null,null,null,null,61.5]
[61.625,2598.3560000000002,61.625,2010.499,null,null,null,null,null,null,null,null,null,null,null,null,null,null,null,null,null,null,null,null,null,null,null,null,null,null,null,null,null,null,null,null,null,null,null,61.625]
[61.75,2564.6840000000002,61.75,2010.499,null,null,null,null,null,null,null,null,null,null,null,null,null,null,null,null,null,null,null,null,null,null,null,null,null,null,null,null,null,null,null,null,null,null,null,61.75]
[61.875,2526.8029999999999,61.875,2010.499,null,null,null,null,null,null,null,null,null,null,null,null,null,null,null,null,null,null,null,null,null,null,null,null,null,null,null,null,null,null,null,null,null,null,null,61.875]
[62,2509.9670000000001,62,2010.499,null,null,null,null,null,null,null,null,null,null,null,null,null,null,null,null,null,null,null,null,null,null,null,null,null,null,null,null,null,null,null,null,null,null,null,62]
[62.125,2476.2950000000001,62.125,2010.499,null,null,null,null,null,null,null,null,null,null,null,null,null,null,null,null,null,null,null,null,null,null,null,null,null,null,null,null,null,null,null,null,null,null,null,62.125]
[62.25,2442.623,62.25,2024.529,null,null,null,null,null,null,null,null,null,null,null,null,null,null,null,null,null,null,null,null,null,null,null,null,null,null,null,null,null,null,null,null,null,null,null,62.25]
[62.375,2408.951,62.375,2010.499,null,null,null,null,null,null,null,null,null,null,null,null,null,null,null,null,null,null,null,null,null,null,null,null,null,null,null,null,null,null,null,null,null,null,null,62.375]
[62.5,2408.951,62.5,2010.499,null,null,null,null,null,null,null,null,null,null,null,null,null,null,null,null,null,null,null,null,null,null,null,null,null,null,null,null,null,null,null,null,null,null,null,62.5]
[62.625,2358.4430000000002,62.625,2010.499,null,null,null,null,null,null,null,null,null,null,null,null,null,null,null,null,null,null,null,null,null,null,null,null,null,null,null,null,null,null,null,null,null,null,null,62.625]
[62.75,2327.5770000000002,62.75,2010.499,null,null,null,null,null,null,null,null,null,null,null,null,null,null,null,null,null,null,null,null,null,null,null,null,null,null,null,null,null,null,null,null,null,null,null,62.75]
[62.875,2295.308,62.875,2010.499,null,null,null,null,null,null,null,null,null,null,null,null,null,null,null,null,null,null,null,null,null,null,null,null,null,null,null,null,null,null,null,null,null,null,null,62.875]
[63,2279.875,63,2024.529,null,null,null,null,null,null,null,null,null,null,null,null,null,null,null,null,null,null,null,null,null,null,null,null,null,null,null,null,null,null,null,null,null,null,null,63]
[63.125,2247.6060000000002,63.125,2010.499,null,null,null,null,null,null,null,null,null,null,null,null,null,null,null,null,null,null,null,null,null,null,null,null,null,null,null,null,null,null,null,null,null,null,null,63.125]
[63.25,2201.3069999999998,63.25,2010.499,null,null,null,null,null,null,null,null,null,null,null,null,null,null,null,null,null,null,null,null,null,null,null,null,null,null,null,null,null,null,null,null,null,null,null,63.25]
[63.375,2185.8739999999998,63.375,2024.529,null,null,null,null,null,null,null,null,null,null,null,null,null,null,null,null,null,null,null,null,null,null,null,null,null,null,null,null,null,null,null,null,null,null,null,63.375]
[63.5,2156.4110000000001,63.5,2010.499,null,null,null,null,null,null,null,null,null,null,null,null,null,null,null,null,null,null,null,null,null,null,null,null,null,null,null,null,null,null,null,null,null,null,null,63.5]
[63.625,2140.9780000000001,63.625,2010.499,null,null,null,null,null,null,null,null,null,null,null,null,null,null,null,null,null,null,null,null,null,null,null,null,null,null,null,null,null,null,null,null,null,null,null,63.625]
[63.75,2110.1120000000001,63.75,2010.499,null,null,null,null,null,null,null,null,null,null,null,null,null,null,null,null,null,null,null,null,null,null,null,null,null,null,null,null,null,null,null,null,null,null,null,63.75]
[63.875,2110.1120000000001,63.875,2024.529,null,null,null,null,null,null,null,null,null,null,null,null,null,null,null,null,null,null,null,null,null,null,null,null,null,null,null,null,null,null,null,null,null,null,null,63.875]

{"sheet":"Version 2.4 Base","index":9,"n_rows":0,"n_cols":0,"rows_kept":0,"cut":false,"hidden":false,"merged":[]}