{"text_format":"1","workbook":"xlsx","n_sheets":3,"sheets":["Beleuchtungsanlagen","Data","Version 1.1"],"not_rendered":{"charts":0,"images":4,"macros":1,"external_links":0,"defined_names":2,"comments":0,"pivot_tables":0},"unopened":[],"bounds":{"document_bytes":16777216,"sheet_cells":100000,"rows_first":2000,"rows_last":500,"rows_between":2000,"halvings":0,"cell_chars":16384,"cell_head_chars":4096},"cells_cut":0,"cells_raw":0,"read":"whole","date_system":"1900"}

{"sheet":"Beleuchtungsanlagen","index":0,"n_rows":259,"n_cols":101,"rows_kept":259,"cut":false,"hidden":false,"merged":[[32,0,32,101],[3,3,4,21],[5,3,6,21],[7,3,8,21],[9,3,10,21],[11,3,12,21],[3,22,4,98],[5,22,6,98],[7,22,8,98],[9,22,10,98],[11,22,12,98],[14,3,14,21],[15,3,15,21],[16,3,16,21],[14,22,14,98],[15,22,15,98],[16,22,16,98],[24,3,24,33],[25,18,25,33],[27,3,27,33],[28,18,28,33],[28,46,28,101],[59,72,59,81],[59,85,59,88],[59,89,59,98],[0,0,1,70],[22,3,22,10],[22,46,22,53],[25,46,25,53],[25,3,25,17],[28,3,28,17],[21,3,21,33],[22,11,22,33],[21,46,21,76],[22,54,22,76],[24,46,24,76],[25,54,25,76],[58,72,58,81],[58,85,58,88],[58,89,58,98],[54,89,54,95],[35,3,38,44],[34,3,34,44],[39,3,39,44],[40,3,43,44],[44,3,44,44],[45,3,48,44],[34,45,34,98],[35,45,38,98],[39,45,39,98],[40,45,43,98],[44,45,44,98],[45,45,48,98],[19,0,19,101],[65,0,65,3],[65,4,65,13],[65,17,65,20],[66,0,66,3],[66,4,66,13],[66,17,66,20],[67,0,67,3],[67,4,67,13],[67,17,67,20],[62,0,62,3],[62,4,62,13],[62,17,62,20],[63,0,63,3],[63,4,63,13],[63,17,63,20],[64,0,64,3],[64,4,64,13],[64,17,64,20],[74,0,74,3],[74,4,74,13],[74,17,74,20],[76,0,76,3],[76,4,76,13],[76,17,76,20],[71,0,71,3],[71,4,71,13],[71,17,71,20],[73,0,73,3],[73,4,73,13],[73,17,73,20],[68,0,68,3],[68,4,68,13],[68,17,68,20],[69,0,69,3],[69,4,69,13],[69,17,69,20],[70,0,70,3],[70,4,70,13],[70,17,70,20],[72,0,72,3],[72,4,72,13],[72,17,72,20],[83,0,83,3],[83,4,83,13],[83,17,83,20],[85,0,85,3],[85,4,85,13],[85,17,85,20],[80,0,80,3],[80,4,80,13],[80,17,80,20],[82,0,82,3],[82,4,82,13],[82,17,82,20],[77,0,77,3],[77,4,77,13],[77,17,77,20],[79,0,79,3],[79,4,79,13],[79,17,79,20],[78,0,78,3],[78,4,78,13],[78,17,78,20],[92,0,92,3],[92,4,92,13],[92,17,92,20],[94,0,94,3],[94,4,94,13],[94,17,94,20],[89,0,89,3],[89,4,89,13],[89,17,89,20],[91,0,91,3],[91,4,91,13],[91,17,91,20],[86,0,86,3],[86,4,86,13],[86,17,86,20],[88,0,88,3],[88,4,88,13],[88,17,88,20],[101,0,101,3],[101,4,101,13],[101,17,101,20],[103,0,103,3],[103,4,103,13],[103,17,103,20],[98,0,98,3],[98,4,98,13],[98,17,98,20],[100,0,100,3],[100,4,100,13],[100,17,100,20],[95,0,95,3],[95,4,95,13],[95,17,95,20],[97,0,97,3],[97,4,97,13],[97,17,97,20],[71,21,71,30],[71,34,71,37],[73,21,73,30],[73,34,73,37],[68,21,68,30],[68,34,68,37],[69,21,69,30],[69,34,69,37],[70,21,70,30],[70,34,70,37],[65,21,65,30],[65,34,65,37],[66,21,66,30],[66,34,66,37],[67,21,67,30],[67,34,67,37],[62,21,62,30],[62,34,62,37],[63,21,63,30],[63,34,63,37],[64,21,64,30],[64,34,64,37],[72,21,72,30],[72,34,72,37],[86,21,86,30],[86,34,86,37],[88,21,88,30],[88,34,88,37],[83,21,83,30],[83,34,83,37],[85,21,85,30],[85,34,85,37],[80,21,80,30],[80,34,80,37],[82,21,82,30],[82,34,82,37],[77,21,77,30],[77,34,77,37],[79,21,79,30],[79,34,79,37],[74,21,74,30],[74,34,74,37],[76,21,76,30],[76,34,76,37],[78,21,78,30],[78,34,78,37],[101,21,101,30],[101,34,101,37],[103,21,103,30],[103,34,103,37],[98,21,98,30],[98,34,98,37],[100,21,100,30],[100,34,100,37],[95,21,95,30],[95,34,95,37],[97,21,97,30],[97,34,97,37],[92,21,92,30],[92,34,92,37],[94,21,94,30],[94,34,94,37],[89,21,89,30],[89,34,89,37],[91,21,91,30],[91,34,91,37],[73,38,73,47],[73,51,73,54],[74,38,74,47],[74,51,74,54],[69,38,69,47],[69,51,69,54],[70,38,70,47],[70,51,70,54],[71,38,71,47],[71,51,71,54],[66,38,66,47],[66,51,66,54],[67,38,67,47],[67,51,67,54],[68,38,68,47],[68,51,68,54],[63,38,63,47],[63,51,63,54],[64,38,64,47],[64,51,64,54],[65,38,65,47],[65,51,65,54],[72,38,72,47],[72,51,72,54],[89,51,89,54],[85,38,85,47],[85,51,85,54],[86,38,86,47],[86,51,86,54],[82,38,82,47],[82,51,82,54],[83,38,83,47],[83,51,83,54],[79,38,79,47],[79,51,79,54],[80,38,80,47],[80,51,80,54],[76,38,76,47],[76,51,76,54],[77,38,77,47],[77,51,77,54],[78,38,78,47],[78,51,78,54],[69,72,69,81],[71,68,71,71],[71,72,71,81],[72,55,72,64],[72,68,72,71],[72,72,72,81],[78,55,78,64],[78,68,78,71],[78,72,78,81],[75,68,75,71],[75,72,75,81],[103,38,103,47],[103,51,103,54],[104,38,104,47],[104,51,104,54],[100,38,100,47],[100,51,100,54],[101,38,101,47],[101,51,101,54],[97,38,97,47],[97,51,97,54],[98,38,98,47],[98,51,98,54],[94,38,94,47],[94,51,94,54],[95,38,95,47],[95,51,95,54],[91,38,91,47],[91,51,91,54],[92,38,92,47],[92,51,92,54],[88,38,88,47],[95,68,95,71],[95,72,95,81],[79,55,79,64],[79,68,79,71],[79,72,79,81],[80,55,80,64],[76,55,76,64],[76,68,76,71],[76,72,76,81],[77,55,77,64],[73,55,73,64],[73,68,73,71],[73,72,73,81],[74,55,74,64],[70,55,70,64],[70,68,70,71],[70,72,70,81],[71,55,71,64],[91,55,91,64],[91,68,91,71],[91,72,91,81],[92,55,92,64],[88,55,88,64],[88,68,88,71],[88,72,88,81],[89,55,89,64],[85,55,85,64],[85,68,85,71],[85,72,85,81],[86,55,86,64],[82,55,82,64],[82,68,82,71],[82,72,82,81],[83,55,83,64],[83,68,83,71],[83,72,83,81],[89,68,89,71],[89,72,89,81],[60,85,60,88],[60,89,60,98],[61,85,61,88],[61,89,61,98],[62,85,62,88],[62,89,62,98],[66,55,66,64],[66,68,66,71],[66,72,66,81],[67,55,67,64],[67,68,67,71],[67,72,67,81],[68,55,68,64],[68,68,68,71],[68,72,68,81],[63,55,63,64],[63,68,63,71],[63,72,63,81],[64,55,64,64],[64,68,64,71],[64,72,64,81],[65,55,65,64],[65,68,65,71],[65,72,65,81],[60,55,60,64],[60,68,60,71],[60,72,60,81],[61,55,61,64],[61,68,61,71],[61,72,61,81],[62,55,62,64],[62,68,62,71],[79,85,79,88],[79,89,79,98],[76,85,76,88],[76,89,76,98],[73,85,73,88],[73,89,73,98],[69,85,69,88],[69,89,69,98],[70,85,70,88],[70,89,70,98],[66,85,66,88],[66,89,66,98],[67,85,67,88],[67,89,67,98],[68,85,68,88],[68,89,68,98],[71,85,71,88],[71,89,71,98],[72,85,72,88],[72,89,72,98],[78,85,78,88],[78,89,78,98],[75,85,75,88],[75,89,75,98],[69,55,69,64],[69,68,69,71],[106,0,106,3],[106,4,106,13],[106,17,106,20],[106,21,106,30],[103,85,103,88],[103,89,103,98],[100,85,100,88],[100,89,100,98],[97,85,97,88],[97,89,97,98],[94,85,94,88],[94,89,94,98],[91,85,91,88],[91,89,91,98],[88,85,88,88],[88,89,88,98],[85,85,85,88],[85,89,85,98],[103,55,103,64],[103,68,103,71],[103,72,103,81],[104,55,104,64],[100,55,100,64],[100,68,100,71],[100,72,100,81],[101,55,101,64],[97,55,97,64],[97,68,97,71],[97,72,97,81],[98,55,98,64],[94,55,94,64],[94,68,94,71],[109,38,109,47],[109,51,109,54],[109,55,109,64],[109,68,109,71],[109,72,109,81],[109,85,109,88],[109,89,109,98],[109,0,109,3],[109,4,109,13],[109,17,109,20],[109,21,109,30],[109,34,109,37],[108,38,108,47],[108,51,108,54],[108,55,108,64],[108,68,108,71],[108,72,108,81],[108,85,108,88],[108,89,108,98],[108,0,108,3],[108,4,108,13],[108,17,108,20],[108,21,108,30],[108,34,108,37],[111,38,111,47],[111,51,111,54],[111,55,111,64],[111,68,111,71],[111,72,111,81],[111,85,111,88],[111,89,111,98],[111,0,111,3],[111,4,111,13],[111,17,111,20],[111,21,111,30],[111,34,111,37],[110,38,110,47],[110,51,110,54],[110,55,110,64],[110,68,110,71],[110,72,110,81],[110,85,110,88],[110,89,110,98],[110,0,110,3],[110,4,110,13],[110,17,110,20],[110,21,110,30],[110,34,110,37],[113,38,113,47],[113,51,113,54],[113,55,113,64],[113,68,113,71],[113,72,113,81],[113,85,113,88],[113,89,113,98],[113,0,113,3],[113,4,113,13],[113,17,113,20],[113,21,113,30],[113,34,113,37],[112,38,112,47],[112,51,112,54],[112,55,112,64],[112,68,112,71],[112,72,112,81],[112,85,112,88],[112,89,112,98],[112,0,112,3],[112,4,112,13],[112,17,112,20],[112,21,112,30],[112,34,112,37],[115,38,115,47],[115,51,115,54],[115,55,115,64],[115,68,115,71],[115,72,115,81],[115,85,115,88],[115,89,115,98],[115,0,115,3],[115,4,115,13],[115,17,115,20],[115,21,115,30],[115,34,115,37],[114,38,114,47],[114,51,114,54],[114,55,114,64],[114,68,114,71],[114,72,114,81],[114,85,114,88],[114,89,114,98],[114,0,114,3],[114,4,114,13],[114,17,114,20],[114,21,114,30],[114,34,114,37],[117,38,117,47],[117,51,117,54],[117,55,117,64],[117,68,117,71],[117,72,117,81],[117,85,117,88],[117,89,117,98],[117,0,117,3],[117,4,117,13],[117,17,117,20],[117,21,117,30],[117,34,117,37],[116,38,116,47],[116,51,116,54],[116,55,116,64],[116,68,116,71],[116,72,116,81],[116,85,116,88],[116,89,116,98],[116,0,116,3],[116,4,116,13],[116,17,116,20],[116,21,116,30],[116,34,116,37],[119,85,119,88],[119,89,119,98],[119,0,119,3],[119,4,119,13],[119,17,119,20],[119,21,119,30],[119,34,119,37],[118,38,118,47],[118,51,118,54],[118,55,118,64],[118,68,118,71],[118,72,118,81],[118,85,118,88],[118,89,118,98],[118,0,118,3],[118,4,118,13],[118,17,118,20],[118,21,118,30],[118,34,118,37],[119,38,119,47],[119,51,119,54],[119,55,119,64],[119,68,119,71],[119,72,119,81],[121,38,121,47],[121,51,121,54],[121,55,121,64],[121,68,121,71],[121,72,121,81],[121,85,121,88],[121,89,121,98],[121,0,121,3],[121,4,121,13],[121,17,121,20],[121,21,121,30],[121,34,121,37],[120,38,120,47],[120,51,120,54],[120,55,120,64],[120,68,120,71],[120,72,120,81],[120,85,120,88],[120,89,120,98],[120,0,120,3],[120,4,120,13],[120,17,120,20],[120,21,120,30],[120,34,120,37],[60,0,60,3],[60,4,60,13],[60,17,60,20],[60,21,60,30],[60,34,60,37],[59,0,59,3],[59,4,59,13],[59,17,59,20],[59,21,59,30],[59,34,59,37],[58,17,58,20],[58,21,58,30],[58,34,58,37],[58,38,58,47],[58,51,58,54],[58,55,58,64],[58,68,58,71],[60,38,60,47],[60,51,60,54],[58,0,58,3],[58,4,58,13],[59,38,59,47],[59,51,59,54],[59,55,59,64],[59,68,59,71],[61,0,61,3],[61,4,61,13],[61,17,61,20],[61,21,61,30],[61,34,61,37],[63,85,63,88],[63,89,63,98],[64,85,64,88],[64,89,64,98],[65,85,65,88],[65,89,65,98],[62,72,62,81],[61,38,61,47],[61,51,61,54],[62,38,62,47],[62,51,62,54],[77,68,77,71],[77,72,77,81],[77,85,77,88],[77,89,77,98],[74,68,74,71],[74,72,74,81],[74,85,74,88],[74,89,74,98],[75,0,75,3],[75,4,75,13],[75,17,75,20],[75,21,75,30],[75,34,75,37],[75,38,75,47],[75,51,75,54],[75,55,75,64],[83,85,83,88],[83,89,83,98],[84,0,84,3],[84,4,84,13],[84,17,84,20],[84,21,84,30],[84,34,84,37],[84,38,84,47],[84,51,84,54],[84,55,84,64],[84,68,84,71],[84,72,84,81],[84,85,84,88],[84,89,84,98],[80,68,80,71],[80,72,80,81],[80,85,80,88],[80,89,80,98],[81,0,81,3],[81,4,81,13],[81,17,81,20],[81,21,81,30],[81,34,81,37],[81,38,81,47],[81,51,81,54],[81,55,81,64],[81,68,81,71],[81,72,81,81],[81,85,81,88],[81,89,81,98],[82,85,82,88],[82,89,82,98],[89,85,89,88],[89,89,89,98],[90,0,90,3],[90,4,90,13],[90,17,90,20],[90,21,90,30],[90,34,90,37],[90,38,90,47],[90,51,90,54],[90,55,90,64],[90,68,90,71],[90,72,90,81],[90,85,90,88],[90,89,90,98],[86,68,86,71],[86,72,86,81],[86,85,86,88],[86,89,86,98],[87,0,87,3],[87,4,87,13],[87,17,87,20],[87,21,87,30],[87,34,87,37],[87,38,87,47],[87,51,87,54],[87,55,87,64],[87,68,87,71],[87,72,87,81],[87,85,87,88],[87,89,87,98],[88,51,88,54],[89,38,89,47],[95,85,95,88],[95,89,95,98],[96,0,96,3],[96,4,96,13],[96,17,96,20],[96,21,96,30],[96,34,96,37],[96,38,96,47],[96,51,96,54],[96,55,96,64],[96,68,96,71],[96,72,96,81],[96,85,96,88],[96,89,96,98],[92,68,92,71],[92,72,92,81],[92,85,92,88],[92,89,92,98],[93,0,93,3],[93,4,93,13],[93,17,93,20],[93,21,93,30],[93,34,93,37],[93,38,93,47],[93,51,93,54],[93,55,93,64],[93,68,93,71],[93,72,93,81],[93,85,93,88],[93,89,93,98],[94,72,94,81],[95,55,95,64],[101,68,101,71],[101,72,101,81],[101,85,101,88],[101,89,101,98],[102,0,102,3],[102,4,102,13],[102,17,102,20],[102,21,102,30],[102,34,102,37],[102,38,102,47],[102,51,102,54],[102,55,102,64],[102,68,102,71],[102,72,102,81],[102,85,102,88],[102,89,102,98],[98,68,98,71],[98,72,98,81],[98,85,98,88],[98,89,98,98],[99,0,99,3],[99,4,99,13],[99,17,99,20],[99,21,99,30],[99,34,99,37],[99,38,99,47],[99,51,99,54],[99,55,99,64],[99,68,99,71],[99,72,99,81],[99,85,99,88],[99,89,99,98],[107,51,107,54],[107,55,107,64],[107,68,107,71],[107,72,107,81],[107,85,107,88],[107,89,107,98],[106,34,106,37],[106,38,106,47],[106,51,106,54],[106,55,106,64],[106,68,106,71],[104,68,104,71],[104,72,104,81],[104,85,104,88],[104,89,104,98],[105,0,105,3],[105,4,105,13],[105,17,105,20],[105,21,105,30],[105,34,105,37],[105,38,105,47],[105,51,105,54],[105,55,105,64],[105,68,105,71],[105,72,105,81],[105,85,105,88],[105,89,105,98],[104,0,104,3],[104,4,104,13],[104,17,104,20],[104,21,104,30],[104,34,104,37],[126,85,126,88],[126,89,126,98],[127,0,127,3],[127,4,127,13],[127,17,127,20],[127,21,127,30],[127,34,127,37],[127,38,127,47],[127,51,127,54],[127,55,127,64],[127,68,127,71],[127,72,127,81],[127,85,127,88],[127,89,127,98],[126,38,126,47],[126,51,126,54],[126,55,126,64],[126,68,126,71],[126,72,126,81],[126,0,126,3],[126,4,126,13],[126,17,126,20],[126,21,126,30],[126,34,126,37],[128,85,128,88],[128,89,128,98],[129,0,129,3],[129,4,129,13],[129,17,129,20],[129,21,129,30],[129,34,129,37],[129,38,129,47],[129,51,129,54],[129,55,129,64],[129,68,129,71],[129,72,129,81],[129,85,129,88],[129,89,129,98],[128,38,128,47],[128,51,128,54],[128,55,128,64],[128,68,128,71],[128,72,128,81],[128,0,128,3],[128,4,128,13],[128,17,128,20],[128,21,128,30],[128,34,128,37],[130,85,130,88],[130,89,130,98],[131,0,131,3],[131,4,131,13],[131,17,131,20],[131,21,131,30],[131,34,131,37],[131,38,131,47],[131,51,131,54],[131,55,131,64],[131,68,131,71],[131,72,131,81],[131,85,131,88],[131,89,131,98],[130,38,130,47],[130,51,130,54],[130,55,130,64],[130,68,130,71],[130,72,130,81],[130,0,130,3],[130,4,130,13],[130,17,130,20],[130,21,130,30],[130,34,130,37],[132,85,132,88],[132,89,132,98],[133,0,133,3],[133,4,133,13],[133,17,133,20],[133,21,133,30],[133,34,133,37],[133,38,133,47],[133,51,133,54],[133,55,133,64],[133,68,133,71],[133,72,133,81],[133,85,133,88],[133,89,133,98],[132,38,132,47],[132,51,132,54],[132,55,132,64],[132,68,132,71],[132,72,132,81],[132,0,132,3],[132,4,132,13],[132,17,132,20],[132,21,132,30],[132,34,132,37],[134,85,134,88],[134,89,134,98],[135,0,135,3],[135,4,135,13],[135,17,135,20],[135,21,135,30],[135,34,135,37],[135,38,135,47],[135,51,135,54],[135,55,135,64],[135,68,135,71],[135,72,135,81],[135,85,135,88],[135,89,135,98],[134,38,134,47],[134,51,134,54],[134,55,134,64],[134,68,134,71],[134,72,134,81],[134,0,134,3],[134,4,134,13],[134,17,134,20],[134,21,134,30],[134,34,134,37],[136,85,136,88],[136,89,136,98],[137,0,137,3],[137,4,137,13],[137,17,137,20],[137,21,137,30],[137,34,137,37],[137,38,137,47],[137,51,137,54],[137,55,137,64],[137,68,137,71],[137,72,137,81],[137,85,137,88],[137,89,137,98],[136,38,136,47],[136,51,136,54],[136,55,136,64],[136,68,136,71],[136,72,136,81],[136,0,136,3],[136,4,136,13],[136,17,136,20],[136,21,136,30],[136,34,136,37],[138,85,138,88],[138,89,138,98],[139,0,139,3],[139,4,139,13],[139,17,139,20],[139,21,139,30],[139,34,139,37],[139,38,139,47],[139,51,139,54],[139,55,139,64],[139,68,139,71],[139,72,139,81],[139,85,139,88],[139,89,139,98],[138,38,138,47],[138,51,138,54],[138,55,138,64],[138,68,138,71],[138,72,138,81],[138,0,138,3],[138,4,138,13],[138,17,138,20],[138,21,138,30],[138,34,138,37],[140,85,140,88],[140,89,140,98],[141,0,141,3],[141,4,141,13],[141,17,141,20],[141,21,141,30],[141,34,141,37],[141,38,141,47],[141,51,141,54],[141,55,141,64],[141,68,141,71],[141,72,141,81],[141,85,141,88],[141,89,141,98],[140,38,140,47],[140,51,140,54],[140,55,140,64],[140,68,140,71],[140,72,140,81],[140,0,140,3],[140,4,140,13],[140,17,140,20],[140,21,140,30],[140,34,140,37],[142,85,142,88]],"merged_total":2379,"flags":["merged_cut"]}
[{"$f":"IF(Data!$B$1=\"DE\",\"Messprotokoll für Beleuchtungsanlagen\",IF(Data!$B$1=\"UK\",\"Measurement protocol for lighting systems\",IF(Data!$B$1=\"FR\",\"Protocole de mesure pour les systèmes d'éclairage\",\"Language Error\")))","v":"Messprotokoll für Beleuchtungsanlagen"}]
[]
[]
[null,null,null,{"$f":"IF(Data!$B$1 = \"DE\", \"Name des Projekts:\", IF(Data!$B$1 = \"UK\",\"Name of the project:\",IF(Data!$B$1=\"FR\",\"Nom du projet:\",\"Language Error\")))","v":"Name des Projekts:"},null,null,null,null,null,null,null,null,null,null,null,null,null,null,null,null,null,null,"Dummyroom"]
[]
[null,null,null,{"$f":"IF(Data!$B$1 = \"DE\", \"PLZ, Ort:\", IF(Data!$B$1 = \"UK\",\"Zip, City:\",IF(Data!$B$1=\"FR\",\"Code postal, Ville:\",\"Language Error\")))","v":"PLZ, Ort:"},null,null,null,null,null,null,null,null,null,null,null,null,null,null,null,null,null,null,"12345, Musterstadt"]
[]
[null,null,null,{"$f":"IF(Data!$B$1 = \"DE\", \"Raumtyp:\", IF(Data!$B$1 = \"UK\",\"Room type:\",IF(Data!$B$1=\"FR\",\"Type de chambre:\",\"Language Error\")))","v":"Raumtyp:"},null,null,null,null,null,null,null,null,null,null,null,null,null,null,null,null,null,null,"Büro"]
[]
[null,null,null,{"$f":"IF(Data!$B$1 = \"DE\", \"Raumgröße:\", IF(Data!$B$1 = \"UK\",\"Room size:\",IF(Data!$B$1=\"FR\",\"Taille de la pièce:\",\"Language Error\")))","v":"Raumgröße:"},null,null,null,null,null,null,null,null,null,null,null,null,null,null,null,null,null,null,"200m²"]
[]
[null,null,null,{"$f":"IF(Data!$B$1 = \"DE\", \"Uhrzeit, Datum der Messung:\", IF(Data!$B$1 = \"UK\",\"Time, date of measurement:\",IF(Data!$B$1=\"FR\",\"Heure, date de mesure:\",\"Language Error\")))","v":"Uhrzeit, Datum der Messung:"},null,null,null,null,null,null,null,null,null,null,null,null,null,null,null,null,null,null,"04.04.2024, 13:08"]
[]
[]
[null,null,null,{"$f":"IF(Data!$B$1=\"DE\",\"Messgerät:\",IF(Data!$B$1=\"UK\",\"Measuring device:\",IF(Data!$B$1=\"FR\",\"Instrument de mesure:\",\"Language Error\")))","v":"Messgerät:"},null,null,null,null,null,null,null,null,null,null,null,null,null,null,null,null,null,null,{"$f":"IF(Data!$B$4=\"\",\"\",Data!$B$4)","v":"GOSSEN MAVOMASTER mit MAVOPROBE 5032 B"}]
[null,null,null,{"$f":"IF(Data!$B$1=\"DE\",\"Seriennummer:\",IF(Data!$B$1=\"UK\",\"Serial number:\",IF(Data!$B$1=\"FR\",\"Numéro de série:\",\"Language Error\")))","v":"Seriennummer:"},null,null,null,null,null,null,null,null,null,null,null,null,null,null,null,null,null,null,{"$f":"IF(Data!$B$5=\"\",\"\",Data!$B$5)","v":"24A12345 und 24A12346"}]
[null,null,null,{"$f":"IF(Data!$B$1=\"DE\",\"Kalibriert am:\",IF(Data!$B$1=\"UK\",\"calibrated on:\",IF(Data!$B$1=\"FR\",\"calibré le:\",\"Language Error\")))","v":"Kalibriert am:"},null,null,null,null,null,null,null,null,null,null,null,null,null,null,null,null,null,null,"2024-04-01"]
[]
[]
[{"$f":"IF(Data!$B$1=\"DE\",\"Messresultate:\",IF(Data!$B$1=\"UK\",\"Measurement results:\",IF(Data!$B$1=\"FR\",\"Résultats de mesure:\",\"Language Error\")))","v":"Messresultate:"}]
[]
[null,null,null,{"$f":"IF(Data!$B$1=\"DE\",\"Mittlere Beleuchtungsstärke\",IF(Data!$B$1=\"UK\",\"Medium illuminance\",IF(Data!$B$1=\"FR\",\"Éclairement moyen\",\"Language Error\")))","v":"Mittlere Beleuchtungsstärke"},null,null,null,null,null,null,null,null,null,null,null,null,null,null,null,null,null,null,null,null,null,null,null,null,null,null,null,null,null,null,null,null,null,null,null,null,null,null,null,null,null,null,{"$f":"IF(Data!$B$1=\"DE\",\"Kleinste Beleuchtungsstärke\",IF(Data!$B$1=\"UK\",\"Smalest illuminance\",IF(Data!$B$1=\"FR\",\"Plus petit éclairement\",\"Language Error\")))","v":"Kleinste Beleuchtungsstärke"}]
[null,null,null,"E avg:",null,null,null,null,null,null,null,{"$f":"TEXT(AVERAGE(Data!B8:B10000),\"0,0\") & \" \" & Data!E8","v":"1013,4 lx"},null,null,null,null,null,null,null,null,null,null,null,null,null,null,null,null,null,null,null,null,null,null,null,null,null,null,null,null,null,null,null,null,null,null,"E min:",null,null,null,null,null,null,null,{"$f":"MIN(Data!B8:B10000) & \" \" & Data!E8","v":"1004,7 lx"}]
[]
[null,null,null,{"$f":"IF(Data!$B$1=\"DE\",\"Gleichmäßigkeit:\",IF(Data!$B$1=\"UK\",\"Uniformity:\",IF(Data!$B$1=\"FR\",\"Uniformité:\",\"Language Error\")))","v":"Gleichmäßigkeit:"},null,null,null,null,null,null,null,null,null,null,null,null,null,null,null,null,null,null,null,null,null,null,null,null,null,null,null,null,null,null,null,null,null,null,null,null,null,null,null,null,null,null,{"$f":"IF(Data!$B$1=\"DE\",\"Maximale Beleuchtungsstärke\",IF(Data!$B$1=\"UK\",\"Maximum illuminance\",IF(Data!$B$1=\"FR\",\"Éclairement maximal\",\"Language Error\")))","v":"Maximale Beleuchtungsstärke"}]
[null,null,null,"E min / E avg",null,null,null,null,null,null,null,null,null,null,null,null,null,null,{"$f":"MIN(Data!B8:B10000)/AVERAGE(Data!B8:B10000)","v":0.99144449372582133},null,null,null,null,null,null,null,null,null,null,null,null,null,null,null,null,null,null,null,null,null,null,null,null,null,null,null,"E max:",null,null,null,null,null,null,null,{"$f":"MAX(Data!B8:B10000) & \" \" & Data!E8","v":"1022,2 lx"}]
[]
[null,null,null,{"$f":"IF(Data!$B$1=\"DE\",\"Ungleichmäßigkeit:\",IF(Data!$B$1=\"UK\",\"Non-Uniformity:\",IF(Data!$B$1=\"FR\",\"Irrégularité:\",\"Language Error\")))","v":"Ungleichmäßigkeit:"}]
[null,null,null,"E min / E max:",null,null,null,null,null,null,null,null,null,null,null,null,null,null,{"$f":"MIN(Data!B8:B10000)/MAX(Data!B8:B10000)","v":0.98288006261005678},null,null,null,null,null,null,null,null,null,null,null,null,null,null,null,null,null,null,null,null,null,null,null,null,null,null,null,{"$f":"IF(Data!$B$1=\"DE\",\"Die Messdaten befinden sich im Anhang\",IF(Data!$B$1=\"UK\",\"The measurement data can be found in the appendix\",IF(Data!$B$1=\"FR\",\"Les données de mesure se trouvent en annexe\",\"Language Error\")))","v":"Die Messdaten befinden sich im Anhang"}]
[]
[]
[]
[{"$f":"IF(Data!$B$1=\"DE\",\"Freigegeben durch:\",IF(Data!$B$1=\"UK\",\"Approved by:\",IF(Data!$B$1=\"FR\",\"Approuvé par:\",\"Language Error\")))","v":"Freigegeben durch:"}]
[]
[null,null,null,{"$f":"IF(Data!$B$1=\"DE\",\"Prüfer\",IF(Data!$B$1=\"UK\",\"Inspector\",IF(Data!$B$1=\"FR\",\"Testeur\",\"Language Error\")))","v":"Prüfer"},null,null,null,null,null,null,null,null,null,null,null,null,null,null,null,null,null,null,null,null,null,null,null,null,null,null,null,null,null,null,null,null,null,null,null,null,null,null,null,null,null,{"$f":"IF(Data!$B$1=\"DE\",\"Stempel / Unterschrift\",IF(Data!$B$1=\"UK\",\"Stamp / Signature\",IF(Data!$B$1=\"FR\",\"Cachet / Signature\",\"Language Error\")))","v":"Stempel / Unterschrift"}]
[]
[]
[]
[]
[null,null,null,{"$f":"IF(Data!$B$1=\"DE\",\"Bauherr\",IF(Data!$B$1=\"UK\",\"Client\",IF(Data!$B$1=\"FR\",\"Client\",\"Language Error\")))","v":"Bauherr"},null,null,null,null,null,null,null,null,null,null,null,null,null,null,null,null,null,null,null,null,null,null,null,null,null,null,null,null,null,null,null,null,null,null,null,null,null,null,null,null,null,{"$f":"IF(Data!$B$1=\"DE\",\"Stempel / Unterschrift\",IF(Data!$B$1=\"UK\",\"Stamp / Signature\",IF(Data!$B$1=\"FR\",\"Cachet / Signature\",\"Language Error\")))","v":"Stempel / Unterschrift"}]
[]
[]
[]
[]
[null,null,null,{"$f":"IF(Data!$B$1=\"DE\",\"Nutzer\",IF(Data!$B$1=\"UK\",\"User\",IF(Data!$B$1=\"FR\",\"Utilisateur\",\"Language Error\")))","v":"Nutzer"},null,null,null,null,null,null,null,null,null,null,null,null,null,null,null,null,null,null,null,null,null,null,null,null,null,null,null,null,null,null,null,null,null,null,null,null,null,null,null,null,null,{"$f":"IF(Data!$B$1=\"DE\",\"Stempel / Unterschrift\",IF(Data!$B$1=\"UK\",\"Stamp / Signature\",IF(Data!$B$1=\"FR\",\"Cachet / Signature\",\"Language Error\")))","v":"Stempel / Unterschrift"}]
[]
[]
[]
[]
[]
[]
[]
[{"$f":"IF(Data!$B$1=\"DE\",\"Ausführende Firma\",IF(Data!$B$1=\"UK\",\"Executive Company\",IF(Data!$B$1=\"FR\",\"Société exécutive\",\"Language Error\")))","v":"Ausführende Firma"},null,null,null,null,null,null,null,null,null,null,null,null,null,null,null,null,null,null,null,null,null,null,null,null,null,null,null,null,null,null,null,null,null,null,null,null,null,null,null,null,null,null,null,null,null,null,null,null,null,null,null,null,null,null,null,null,null,null,null,null,null,null,null,null,null,null,null,null,null,null,null,null,null,null,null,null,null,null,null,null,null,null,null,null,null,null,null,null,null,null,null,null,null,null,null,null,null,null,null,2]
[{"$f":"IF(Data!$B$1=\"DE\",\"Adresse\",IF(Data!$B$1=\"UK\",\"Address\",IF(Data!$B$1=\"FR\",\"Adresse\",\"Language Error\")))","v":"Adresse"}]
[{"$f":"IF(Data!$B$1=\"DE\",\"PLZ  Ort\",IF(Data!$B$1=\"UK\",\"ZIP  City\",IF(Data!$B$1=\"FR\",\"Code postal Ville\",\"Language Error\")))","v":"PLZ  Ort"},null,null,null,null,null,null,null,null,null,null,null,null,null,null,null,null,null,null,null,null,null,null,null,null,null,null,null,null,null,null,null,null,null,null,null,null,null,null,null,null,null,null,null,null,null,null,null,null,null,null,null,null,null,null,null,null,null,null,null,null,null,null,null,null,null,null,null,null,null,null,null,null,null,null,null,null,null,null,null,null,null,null,null,null,null,null,null,null,{"$f":"IF(Data!$B$1=\"DE\",\"Seite\",IF(Data!$B$1=\"UK\",\"Page\",IF(Data!$B$1=\"FR\",\"Page\",\"Language Error\")))","v":"Seite"},null,null,null,null,null,null,1,null,"/",null,2]
[{"$f":"IF(Data!$B$1=\"DE\",\"Messdaten\",IF(Data!$B$1=\"UK\",\"Measured data\",IF(Data!$B$1=\"FR\",\"données de mesure\",\"Language Error\")))","v":"Messdaten"},null,null,null,null,null,null,null,null,null,null,null,null,null,null,null,null,null,null,null,null,null,null,null,null,null,null,null,null,null,null,{"$f":"$W$4 & CHAR(10) & $W$6","v":"Dummyroom\n12345, Musterstadt"},null,null,null,null,null,null,null,null,null,null,null,null,null,null,null,null,null,null,null,null,null,null,null,null,null,null,null,null,null,null,null,null,null,null,null,null,null,null,null,null,null,null,null,null,null,null,null,null,null,null,{"$f":"$W$12","v":"04.04.2024, 13:08"}]
[]
[]
[1,null,null,null,"1022,2 lx",null,null,null,null,null,null,null,null,null,null,null,null,65,null,null,null,"1013,6 lx",null,null,null,null,null,null,null,null,null,null,null,null,129,null,null,null,"1007,1 lx",null,null,null,null,null,null,null,null,null,null,null,null,193,null,null,null,"1016,8 lx",null,null,null,null,null,null,null,null,null,null,null,null,257,null,null,null,"1011,9 lx",null,null,null,null,null,null,null,null,null,null,null,null,321,null,null,null,"1022,2 lx"]
[2,null,null,null,"1019,3 lx",null,null,null,null,null,null,null,null,null,null,null,null,66,null,null,null,"1013,9 lx",null,null,null,null,null,null,null,null,null,null,null,null,130,null,null,null,"1004,7 lx",null,null,null,null,null,null,null,null,null,null,null,null,194,null,null,null,"1014,8 lx",null,null,null,null,null,null,null,null,null,null,null,null,258,null,null,null,"1009 lx",null,null,null,null,null,null,null,null,null,null,null,null,322,null,null,null,"1019,3 lx"]
[3,null,null,null,"1016,8 lx",null,null,null,null,null,null,null,null,null,null,null,null,67,null,null,null,"1011,9 lx",null,null,null,null,null,null,null,null,null,null,null,null,131,null,null,null,"1022,2 lx",null,null,null,null,null,null,null,null,null,null,null,null,195,null,null,null,"1013,6 lx",null,null,null,null,null,null,null,null,null,null,null,null,259,null,null,null,"1007,1 lx",null,null,null,null,null,null,null,null,null,null,null,null,323,null,null,null,"1016,8 lx"]
[4,null,null,null,"1014,8 lx",null,null,null,null,null,null,null,null,null,null,null,null,68,null,null,null,"1009 lx",null,null,null,null,null,null,null,null,null,null,null,null,132,null,null,null,"1019,3 lx",null,null,null,null,null,null,null,null,null,null,null,null,196,null,null,null,"1013,9 lx",null,null,null,null,null,null,null,null,null,null,null,null,260,null,null,null,"1004,7 lx",null,null,null,null,null,null,null,null,null,null,null,null,324,null,null,null,"1014,8 lx"]
[5,null,null,null,"1013,6 lx",null,null,null,null,null,null,null,null,null,null,null,null,69,null,null,null,"1007,1 lx",null,null,null,null,null,null,null,null,null,null,null,null,133,null,null,null,"1016,8 lx",null,null,null,null,null,null,null,null,null,null,null,null,197,null,null,null,"1011,9 lx",null,null,null,null,null,null,null,null,null,null,null,null,261,null,null,null,"1022,2 lx",null,null,null,null,null,null,null,null,null,null,null,null,325,null,null,null,"1013,6 lx"]
[6,null,null,null,"1013,9 lx",null,null,null,null,null,null,null,null,null,null,null,null,70,null,null,null,"1004,7 lx",null,null,null,null,null,null,null,null,null,null,null,null,134,null,null,null,"1014,8 lx",null,null,null,null,null,null,null,null,null,null,null,null,198,null,null,null,"1009 lx",null,null,null,null,null,null,null,null,null,null,null,null,262,null,null,null,"1019,3 lx",null,null,null,null,null,null,null,null,null,null,null,null,326,null,null,null,"1013,9 lx"]
[7,null,null,null,"1011,9 lx",null,null,null,null,null,null,null,null,null,null,null,null,71,null,null,null,"1022,2 lx",null,null,null,null,null,null,null,null,null,null,null,null,135,null,null,null,"1013,6 lx",null,null,null,null,null,null,null,null,null,null,null,null,199,null,null,null,"1007,1 lx",null,null,null,null,null,null,null,null,null,null,null,null,263,null,null,null,"1016,8 lx",null,null,null,null,null,null,null,null,null,null,null,null,327,null,null,null,"1011,9 lx"]
[8,null,null,null,"1009 lx",null,null,null,null,null,null,null,null,null,null,null,null,72,null,null,null,"1019,3 lx",null,null,null,null,null,null,null,null,null,null,null,null,136,null,null,null,"1013,9 lx",null,null,null,null,null,null,null,null,null,null,null,null,200,null,null,null,"1004,7 lx",null,null,null,null,null,null,null,null,null,null,null,null,264,null,null,null,"1014,8 lx",null,null,null,null,null,null,null,null,null,null,null,null,328,null,null,null,"1009 lx"]
[9,null,null,null,"1007,1 lx",null,null,null,null,null,null,null,null,null,null,null,null,73,null,null,null,"1016,8 lx",null,null,null,null,null,null,null,null,null,null,null,null,137,null,null,null,"1011,9 lx",null,null,null,null,null,null,null,null,null,null,null,null,201,null,null,null,"1022,2 lx",null,null,null,null,null,null,null,null,null,null,null,null,265,null,null,null,"1013,6 lx",null,null,null,null,null,null,null,null,null,null,null,null,329,null,null,null,"1007,1 lx"]
[10,null,null,null,"1004,7 lx",null,null,null,null,null,null,null,null,null,null,null,null,74,null,null,null,"1014,8 lx",null,null,null,null,null,null,null,null,null,null,null,null,138,null,null,null,"1009 lx",null,null,null,null,null,null,null,null,null,null,null,null,202,null,null,null,"1019,3 lx",null,null,null,null,null,null,null,null,null,null,null,null,266,null,null,null,"1013,9 lx",null,null,null,null,null,null,null,null,null,null,null,null,330,null,null,null,"1004,7 lx"]
[11,null,null,null,"1022,2 lx",null,null,null,null,null,null,null,null,null,null,null,null,75,null,null,null,"1013,6 lx",null,null,null,null,null,null,null,null,null,null,null,null,139,null,null,null,"1007,1 lx",null,null,null,null,null,null,null,null,null,null,null,null,203,null,null,null,"1016,8 lx",null,null,null,null,null,null,null,null,null,null,null,null,267,null,null,null,"1011,9 lx",null,null,null,null,null,null,null,null,null,null,null,null,331,null,null,null,"1022,2 lx"]
[12,null,null,null,"1019,3 lx",null,null,null,null,null,null,null,null,null,null,null,null,76,null,null,null,"1013,9 lx",null,null,null,null,null,null,null,null,null,null,null,null,140,null,null,null,"1004,7 lx",null,null,null,null,null,null,null,null,null,null,null,null,204,null,null,null,"1014,8 lx",null,null,null,null,null,null,null,null,null,null,null,null,268,null,null,null,"1009 lx",null,null,null,null,null,null,null,null,null,null,null,null,332,null,null,null,"1019,3 lx"]
[13,null,null,null,"1016,8 lx",null,null,null,null,null,null,null,null,null,null,null,null,77,null,null,null,"1011,9 lx",null,null,null,null,null,null,null,null,null,null,null,null,141,null,null,null,"1022,2 lx",null,null,null,null,null,null,null,null,null,null,null,null,205,null,null,null,"1013,6 lx",null,null,null,null,null,null,null,null,null,null,null,null,269,null,null,null,"1007,1 lx",null,null,null,null,null,null,null,null,null,null,null,null,333,null,null,null,"1016,8 lx"]
[14,null,null,null,"1014,8 lx",null,null,null,null,null,null,null,null,null,null,null,null,78,null,null,null,"1009 lx",null,null,null,null,null,null,null,null,null,null,null,null,142,null,null,null,"1019,3 lx",null,null,null,null,null,null,null,null,null,null,null,null,206,null,null,null,"1013,9 lx",null,null,null,null,null,null,null,null,null,null,null,null,270,null,null,null,"1004,7 lx",null,null,null,null,null,null,null,null,null,null,null,null,334,null,null,null,"1014,8 lx"]
[15,null,null,null,"1013,6 lx",null,null,null,null,null,null,null,null,null,null,null,null,79,null,null,null,"1007,1 lx",null,null,null,null,null,null,null,null,null,null,null,null,143,null,null,null,"1016,8 lx",null,null,null,null,null,null,null,null,null,null,null,null,207,null,null,null,"1011,9 lx",null,null,null,null,null,null,null,null,null,null,null,null,271,null,null,null,"1022,2 lx",null,null,null,null,null,null,null,null,null,null,null,null,335,null,null,null,"1013,6 lx"]
[16,null,null,null,"1013,9 lx",null,null,null,null,null,null,null,null,null,null,null,null,80,null,null,null,"1004,7 lx",null,null,null,null,null,null,null,null,null,null,null,null,144,null,null,null,"1014,8 lx",null,null,null,null,null,null,null,null,null,null,null,null,208,null,null,null,"1009 lx",null,null,null,null,null,null,null,null,null,null,null,null,272,null,null,null,"1019,3 lx",null,null,null,null,null,null,null,null,null,null,null,null,336,null,null,null,"1013,9 lx"]
[17,null,null,null,"1011,9 lx",null,null,null,null,null,null,null,null,null,null,null,null,81,null,null,null,"1022,2 lx",null,null,null,null,null,null,null,null,null,null,null,null,145,null,null,null,"1013,6 lx",null,null,null,null,null,null,null,null,null,null,null,null,209,null,null,null,"1007,1 lx",null,null,null,null,null,null,null,null,null,null,null,null,273,null,null,null,"1016,8 lx",null,null,null,null,null,null,null,null,null,null,null,null,337,null,null,null,"1011,9 lx"]
[18,null,null,null,"1009 lx",null,null,null,null,null,null,null,null,null,null,null,null,82,null,null,null,"1019,3 lx",null,null,null,null,null,null,null,null,null,null,null,null,146,null,null,null,"1013,9 lx",null,null,null,null,null,null,null,null,null,null,null,null,210,null,null,null,"1004,7 lx",null,null,null,null,null,null,null,null,null,null,null,null,274,null,null,null,"1014,8 lx",null,null,null,null,null,null,null,null,null,null,null,null,338,null,null,null,"1009 lx"]
[19,null,null,null,"1007,1 lx",null,null,null,null,null,null,null,null,null,null,null,null,83,null,null,null,"1016,8 lx",null,null,null,null,null,null,null,null,null,null,null,null,147,null,null,null,"1011,9 lx",null,null,null,null,null,null,null,null,null,null,null,null,211,null,null,null,"1022,2 lx",null,null,null,null,null,null,null,null,null,null,null,null,275,null,null,null,"1013,6 lx",null,null,null,null,null,null,null,null,null,null,null,null,339,null,null,null,"1007,1 lx"]
[20,null,null,null,"1004,7 lx",null,null,null,null,null,null,null,null,null,null,null,null,84,null,null,null,"1014,8 lx",null,null,null,null,null,null,null,null,null,null,null,null,148,null,null,null,"1009 lx",null,null,null,null,null,null,null,null,null,null,null,null,212,null,null,null,"1019,3 lx",null,null,null,null,null,null,null,null,null,null,null,null,276,null,null,null,"1013,9 lx",null,null,null,null,null,null,null,null,null,null,null,null,340,null,null,null,"1004,7 lx"]
[21,null,null,null,"1022,2 lx",null,null,null,null,null,null,null,null,null,null,null,null,85,null,null,null,"1013,6 lx",null,null,null,null,null,null,null,null,null,null,null,null,149,null,null,null,"1007,1 lx",null,null,null,null,null,null,null,null,null,null,null,null,213,null,null,null,"1016,8 lx",null,null,null,null,null,null,null,null,null,null,null,null,277,null,null,null,"1011,9 lx",null,null,null,null,null,null,null,null,null,null,null,null,341,null,null,null,"1022,2 lx"]
[22,null,null,null,"1019,3 lx",null,null,null,null,null,null,null,null,null,null,null,null,86,null,null,null,"1013,9 lx",null,null,null,null,null,null,null,null,null,null,null,null,150,null,null,null,"1004,7 lx",null,null,null,null,null,null,null,null,null,null,null,null,214,null,null,null,"1014,8 lx",null,null,null,null,null,null,null,null,null,null,null,null,278,null,null,null,"1009 lx",null,null,null,null,null,null,null,null,null,null,null,null,342,null,null,null,"1019,3 lx"]
[23,null,null,null,"1016,8 lx",null,null,null,null,null,null,null,null,null,null,null,null,87,null,null,null,"1011,9 lx",null,null,null,null,null,null,null,null,null,null,null,null,151,null,null,null,"1022,2 lx",null,null,null,null,null,null,null,null,null,null,null,null,215,null,null,null,"1013,6 lx",null,null,null,null,null,null,null,null,null,null,null,null,279,null,null,null,"1007,1 lx",null,null,null,null,null,null,null,null,null,null,null,null,343,null,null,null,"1016,8 lx"]
[24,null,null,null,"1014,8 lx",null,null,null,null,null,null,null,null,null,null,null,null,88,null,null,null,"1009 lx",null,null,null,null,null,null,null,null,null,null,null,null,152,null,null,null,"1019,3 lx",null,null,null,null,null,null,null,null,null,null,null,null,216,null,null,null,"1013,9 lx",null,null,null,null,null,null,null,null,null,null,null,null,280,null,null,null,"1004,7 lx",null,null,null,null,null,null,null,null,null,null,null,null,344,null,null,null,"1014,8 lx"]
[25,null,null,null,"1013,6 lx",null,null,null,null,null,null,null,null,null,null,null,null,89,null,null,null,"1007,1 lx",null,null,null,null,null,null,null,null,null,null,null,null,153,null,null,null,"1016,8 lx",null,null,null,null,null,null,null,null,null,null,null,null,217,null,null,null,"1011,9 lx",null,null,null,null,null,null,null,null,null,null,null,null,281,null,null,null,"1022,2 lx",null,null,null,null,null,null,null,null,null,null,null,null,345,null,null,null,"1013,6 lx"]
[26,null,null,null,"1013,9 lx",null,null,null,null,null,null,null,null,null,null,null,null,90,null,null,null,"1004,7 lx",null,null,null,null,null,null,null,null,null,null,null,null,154,null,null,null,"1014,8 lx",null,null,null,null,null,null,null,null,null,null,null,null,218,null,null,null,"1009 lx",null,null,null,null,null,null,null,null,null,null,null,null,282,null,null,null,"1019,3 lx",null,null,null,null,null,null,null,null,null,null,null,null,346,null,null,null,"1013,9 lx"]
[27,null,null,null,"1011,9 lx",null,null,null,null,null,null,null,null,null,null,null,null,91,null,null,null,"1022,2 lx",null,null,null,null,null,null,null,null,null,null,null,null,155,null,null,null,"1013,6 lx",null,null,null,null,null,null,null,null,null,null,null,null,219,null,null,null,"1007,1 lx",null,null,null,null,null,null,null,null,null,null,null,null,283,null,null,null,"1016,8 lx",null,null,null,null,null,null,null,null,null,null,null,null,347,null,null,null,"1011,9 lx"]
[28,null,null,null,"1009 lx",null,null,null,null,null,null,null,null,null,null,null,null,92,null,null,null,"1019,3 lx",null,null,null,null,null,null,null,null,null,null,null,null,156,null,null,null,"1013,9 lx",null,null,null,null,null,null,null,null,null,null,null,null,220,null,null,null,"1004,7 lx",null,null,null,null,null,null,null,null,null,null,null,null,284,null,null,null,"1014,8 lx",null,null,null,null,null,null,null,null,null,null,null,null,348,null,null,null,"1009 lx"]
[29,null,null,null,"1007,1 lx",null,null,null,null,null,null,null,null,null,null,null,null,93,null,null,null,"1016,8 lx",null,null,null,null,null,null,null,null,null,null,null,null,157,null,null,null,"1011,9 lx",null,null,null,null,null,null,null,null,null,null,null,null,221,null,null,null,"1022,2 lx",null,null,null,null,null,null,null,null,null,null,null,null,285,null,null,null,"1013,6 lx",null,null,null,null,null,null,null,null,null,null,null,null,349,null,null,null,"1007,1 lx"]
[30,null,null,null,"1004,7 lx",null,null,null,null,null,null,null,null,null,null,null,null,94,null,null,null,"1014,8 lx",null,null,null,null,null,null,null,null,null,null,null,null,158,null,null,null,"1009 lx",null,null,null,null,null,null,null,null,null,null,null,null,222,null,null,null,"1019,3 lx",null,null,null,null,null,null,null,null,null,null,null,null,286,null,null,null,"1013,9 lx",null,null,null,null,null,null,null,null,null,null,null,null,350,null,null,null,"1004,7 lx"]
[31,null,null,null,"1022,2 lx",null,null,null,null,null,null,null,null,null,null,null,null,95,null,null,null,"1013,6 lx",null,null,null,null,null,null,null,null,null,null,null,null,159,null,null,null,"1007,1 lx",null,null,null,null,null,null,null,null,null,null,null,null,223,null,null,null,"1016,8 lx",null,null,null,null,null,null,null,null,null,null,null,null,287,null,null,null,"1011,9 lx",null,null,null,null,null,null,null,null,null,null,null,null,351,null,null,null,"1022,2 lx"]
[32,null,null,null,"1019,3 lx",null,null,null,null,null,null,null,null,null,null,null,null,96,null,null,null,"1013,9 lx",null,null,null,null,null,null,null,null,null,null,null,null,160,null,null,null,"1004,7 lx",null,null,null,null,null,null,null,null,null,null,null,null,224,null,null,null,"1014,8 lx",null,null,null,null,null,null,null,null,null,null,null,null,288,null,null,null,"1009 lx",null,null,null,null,null,null,null,null,null,null,null,null,352,null,null,null,"1019,3 lx"]
[33,null,null,null,"1016,8 lx",null,null,null,null,null,null,null,null,null,null,null,null,97,null,null,null,"1011,9 lx",null,null,null,null,null,null,null,null,null,null,null,null,161,null,null,null,"1022,2 lx",null,null,null,null,null,null,null,null,null,null,null,null,225,null,null,null,"1013,6 lx",null,null,null,null,null,null,null,null,null,null,null,null,289,null,null,null,"1007,1 lx",null,null,null,null,null,null,null,null,null,null,null,null,353,null,null,null,"1016,8 lx"]
[34,null,null,null,"1014,8 lx",null,null,null,null,null,null,null,null,null,null,null,null,98,null,null,null,"1009 lx",null,null,null,null,null,null,null,null,null,null,null,null,162,null,null,null,"1019,3 lx",null,null,null,null,null,null,null,null,null,null,null,null,226,null,null,null,"1013,9 lx",null,null,null,null,null,null,null,null,null,null,null,null,290,null,null,null,"1004,7 lx",null,null,null,null,null,null,null,null,null,null,null,null,354,null,null,null,"1014,8 lx"]
[35,null,null,null,"1013,6 lx",null,null,null,null,null,null,null,null,null,null,null,null,99,null,null,null,"1007,1 lx",null,null,null,null,null,null,null,null,null,null,null,null,163,null,null,null,"1016,8 lx",null,null,null,null,null,null,null,null,null,null,null,null,227,null,null,null,"1011,9 lx",null,null,null,null,null,null,null,null,null,null,null,null,291,null,null,null,"1022,2 lx",null,null,null,null,null,null,null,null,null,null,null,null,355,null,null,null,"1013,6 lx"]
[36,null,null,null,"1013,9 lx",null,null,null,null,null,null,null,null,null,null,null,null,100,null,null,null,"1004,7 lx",null,null,null,null,null,null,null,null,null,null,null,null,164,null,null,null,"1014,8 lx",null,null,null,null,null,null,null,null,null,null,null,null,228,null,null,null,"1009 lx",null,null,null,null,null,null,null,null,null,null,null,null,292,null,null,null,"1019,3 lx",null,null,null,null,null,null,null,null,null,null,null,null,356,null,null,null,"1013,9 lx"]
[37,null,null,null,"1011,9 lx",null,null,null,null,null,null,null,null,null,null,null,null,101,null,null,null,"1022,2 lx",null,null,null,null,null,null,null,null,null,null,null,null,165,null,null,null,"1013,6 lx",null,null,null,null,null,null,null,null,null,null,null,null,229,null,null,null,"1007,1 lx",null,null,null,null,null,null,null,null,null,null,null,null,293,null,null,null,"1016,8 lx",null,null,null,null,null,null,null,null,null,null,null,null,357,null,null,null,"1011,9 lx"]
[38,null,null,null,"1009 lx",null,null,null,null,null,null,null,null,null,null,null,null,102,null,null,null,"1019,3 lx",null,null,null,null,null,null,null,null,null,null,null,null,166,null,null,null,"1013,9 lx",null,null,null,null,null,null,null,null,null,null,null,null,230,null,null,null,"1004,7 lx",null,null,null,null,null,null,null,null,null,null,null,null,294,null,null,null,"1014,8 lx",null,null,null,null,null,null,null,null,null,null,null,null,358,null,null,null,"1009 lx"]
[39,null,null,null,"1007,1 lx",null,null,null,null,null,null,null,null,null,null,null,null,103,null,null,null,"1016,8 lx",null,null,null,null,null,null,null,null,null,null,null,null,167,null,null,null,"1011,9 lx",null,null,null,null,null,null,null,null,null,null,null,null,231,null,null,null,"1022,2 lx",null,null,null,null,null,null,null,null,null,null,null,null,295,null,null,null,"1013,6 lx",null,null,null,null,null,null,null,null,null,null,null,null,359,null,null,null,"1007,1 lx"]
[40,null,null,null,"1004,7 lx",null,null,null,null,null,null,null,null,null,null,null,null,104,null,null,null,"1014,8 lx",null,null,null,null,null,null,null,null,null,null,null,null,168,null,null,null,"1009 lx",null,null,null,null,null,null,null,null,null,null,null,null,232,null,null,null,"1019,3 lx",null,null,null,null,null,null,null,null,null,null,null,null,296,null,null,null,"1013,9 lx",null,null,null,null,null,null,null,null,null,null,null,null,360,null,null,null,"1004,7 lx"]
[41,null,null,null,"1022,2 lx",null,null,null,null,null,null,null,null,null,null,null,null,105,null,null,null,"1013,6 lx",null,null,null,null,null,null,null,null,null,null,null,null,169,null,null,null,"1007,1 lx",null,null,null,null,null,null,null,null,null,null,null,null,233,null,null,null,"1016,8 lx",null,null,null,null,null,null,null,null,null,null,null,null,297,null,null,null,"1011,9 lx",null,null,null,null,null,null,null,null,null,null,null,null,361,null,null,null,"1022,2 lx"]
[42,null,null,null,"1019,3 lx",null,null,null,null,null,null,null,null,null,null,null,null,106,null,null,null,"1013,9 lx",null,null,null,null,null,null,null,null,null,null,null,null,170,null,null,null,"1004,7 lx",null,null,null,null,null,null,null,null,null,null,null,null,234,null,null,null,"1014,8 lx",null,null,null,null,null,null,null,null,null,null,null,null,298,null,null,null,"1009 lx",null,null,null,null,null,null,null,null,null,null,null,null,362,null,null,null,"1019,3 lx"]
[43,null,null,null,"1016,8 lx",null,null,null,null,null,null,null,null,null,null,null,null,107,null,null,null,"1011,9 lx",null,null,null,null,null,null,null,null,null,null,null,null,171,null,null,null,"1022,2 lx",null,null,null,null,null,null,null,null,null,null,null,null,235,null,null,null,"1013,6 lx",null,null,null,null,null,null,null,null,null,null,null,null,299,null,null,null,"1007,1 lx",null,null,null,null,null,null,null,null,null,null,null,null,363,null,null,null,"1016,8 lx"]
[44,null,null,null,"1014,8 lx",null,null,null,null,null,null,null,null,null,null,null,null,108,null,null,null,"1009 lx",null,null,null,null,null,null,null,null,null,null,null,null,172,null,null,null,"1019,3 lx",null,null,null,null,null,null,null,null,null,null,null,null,236,null,null,null,"1013,9 lx",null,null,null,null,null,null,null,null,null,null,null,null,300,null,null,null,"1004,7 lx",null,null,null,null,null,null,null,null,null,null,null,null,364,null,null,null,"1014,8 lx"]
[45,null,null,null,"1013,6 lx",null,null,null,null,null,null,null,null,null,null,null,null,109,null,null,null,"1007,1 lx",null,null,null,null,null,null,null,null,null,null,null,null,173,null,null,null,"1016,8 lx",null,null,null,null,null,null,null,null,null,null,null,null,237,null,null,null,"1011,9 lx",null,null,null,null,null,null,null,null,null,null,null,null,301,null,null,null,"1022,2 lx",null,null,null,null,null,null,null,null,null,null,null,null,365,null,null,null,"1013,6 lx"]
[46,null,null,null,"1013,9 lx",null,null,null,null,null,null,null,null,null,null,null,null,110,null,null,null,"1004,7 lx",null,null,null,null,null,null,null,null,null,null,null,null,174,null,null,null,"1014,8 lx",null,null,null,null,null,null,null,null,null,null,null,null,238,null,null,null,"1009 lx",null,null,null,null,null,null,null,null,null,null,null,null,302,null,null,null,"1019,3 lx",null,null,null,null,null,null,null,null,null,null,null,null,366,null,null,null,"1013,9 lx"]
[47,null,null,null,"1011,9 lx",null,null,null,null,null,null,null,null,null,null,null,null,111,null,null,null,"1022,2 lx",null,null,null,null,null,null,null,null,null,null,null,null,175,null,null,null,"1013,6 lx",null,null,null,null,null,null,null,null,null,null,null,null,239,null,null,null,"1007,1 lx",null,null,null,null,null,null,null,null,null,null,null,null,303,null,null,null,"1016,8 lx",null,null,null,null,null,null,null,null,null,null,null,null,367,null,null,null,"1011,9 lx"]
[48,null,null,null,"1009 lx",null,null,null,null,null,null,null,null,null,null,null,null,112,null,null,null,"1019,3 lx",null,null,null,null,null,null,null,null,null,null,null,null,176,null,null,null,"1013,9 lx",null,null,null,null,null,null,null,null,null,null,null,null,240,null,null,null,"1004,7 lx",null,null,null,null,null,null,null,null,null,null,null,null,304,null,null,null,"1014,8 lx",null,null,null,null,null,null,null,null,null,null,null,null,368,null,null,null,"1009 lx"]
[49,null,null,null,"1007,1 lx",null,null,null,null,null,null,null,null,null,null,null,null,113,null,null,null,"1016,8 lx",null,null,null,null,null,null,null,null,null,null,null,null,177,null,null,null,"1011,9 lx",null,null,null,null,null,null,null,null,null,null,null,null,241,null,null,null,"1022,2 lx",null,null,null,null,null,null,null,null,null,null,null,null,305,null,null,null,"1013,6 lx",null,null,null,null,null,null,null,null,null,null,null,null,369,null,null,null,"1007,1 lx"]
[50,null,null,null,"1004,7 lx",null,null,null,null,null,null,null,null,null,null,null,null,114,null,null,null,"1014,8 lx",null,null,null,null,null,null,null,null,null,null,null,null,178,null,null,null,"1009 lx",null,null,null,null,null,null,null,null,null,null,null,null,242,null,null,null,"1019,3 lx",null,null,null,null,null,null,null,null,null,null,null,null,306,null,null,null,"1013,9 lx",null,null,null,null,null,null,null,null,null,null,null,null,370,null,null,null,"1004,7 lx"]
[51,null,null,null,"1022,2 lx",null,null,null,null,null,null,null,null,null,null,null,null,115,null,null,null,"1013,6 lx",null,null,null,null,null,null,null,null,null,null,null,null,179,null,null,null,"1007,1 lx",null,null,null,null,null,null,null,null,null,null,null,null,243,null,null,null,"1016,8 lx",null,null,null,null,null,null,null,null,null,null,null,null,307,null,null,null,"1011,9 lx",null,null,null,null,null,null,null,null,null,null,null,null,371,null,null,null,"1022,2 lx"]
[52,null,null,null,"1019,3 lx",null,null,null,null,null,null,null,null,null,null,null,null,116,null,null,null,"1013,9 lx",null,null,null,null,null,null,null,null,null,null,null,null,180,null,null,null,"1004,7 lx",null,null,null,null,null,null,null,null,null,null,null,null,244,null,null,null,"1014,8 lx",null,null,null,null,null,null,null,null,null,null,null,null,308,null,null,null,"1009 lx",null,null,null,null,null,null,null,null,null,null,null,null,372,null,null,null,"1019,3 lx"]
[53,null,null,null,"1016,8 lx",null,null,null,null,null,null,null,null,null,null,null,null,117,null,null,null,"1011,9 lx",null,null,null,null,null,null,null,null,null,null,null,null,181,null,null,null,"1022,2 lx",null,null,null,null,null,null,null,null,null,null,null,null,245,null,null,null,"1013,6 lx",null,null,null,null,null,null,null,null,null,null,null,null,309,null,null,null,"1007,1 lx"]
[54,null,null,null,"1014,8 lx",null,null,null,null,null,null,null,null,null,null,null,null,118,null,null,null,"1009 lx",null,null,null,null,null,null,null,null,null,null,null,null,182,null,null,null,"1019,3 lx",null,null,null,null,null,null,null,null,null,null,null,null,246,null,null,null,"1013,9 lx",null,null,null,null,null,null,null,null,null,null,null,null,310,null,null,null,"1004,7 lx"]
[55,null,null,null,"1013,6 lx",null,null,null,null,null,null,null,null,null,null,null,null,119,null,null,null,"1007,1 lx",null,null,null,null,null,null,null,null,null,null,null,null,183,null,null,null,"1016,8 lx",null,null,null,null,null,null,null,null,null,null,null,null,247,null,null,null,"1011,9 lx",null,null,null,null,null,null,null,null,null,null,null,null,311,null,null,null,"1022,2 lx"]
[56,null,null,null,"1013,9 lx",null,null,null,null,null,null,null,null,null,null,null,null,120,null,null,null,"1004,7 lx",null,null,null,null,null,null,null,null,null,null,null,null,184,null,null,null,"1014,8 lx",null,null,null,null,null,null,null,null,null,null,null,null,248,null,null,null,"1009 lx",null,null,null,null,null,null,null,null,null,null,null,null,312,null,null,null,"1019,3 lx"]
[57,null,null,null,"1011,9 lx",null,null,null,null,null,null,null,null,null,null,null,null,121,null,null,null,"1022,2 lx",null,null,null,null,null,null,null,null,null,null,null,null,185,null,null,null,"1013,6 lx",null,null,null,null,null,null,null,null,null,null,null,null,249,null,null,null,"1007,1 lx",null,null,null,null,null,null,null,null,null,null,null,null,313,null,null,null,"1016,8 lx"]
[58,null,null,null,"1009 lx",null,null,null,null,null,null,null,null,null,null,null,null,122,null,null,null,"1019,3 lx",null,null,null,null,null,null,null,null,null,null,null,null,186,null,null,null,"1013,9 lx",null,null,null,null,null,null,null,null,null,null,null,null,250,null,null,null,"1004,7 lx",null,null,null,null,null,null,null,null,null,null,null,null,314,null,null,null,"1014,8 lx"]
[59,null,null,null,"1007,1 lx",null,null,null,null,null,null,null,null,null,null,null,null,123,null,null,null,"1016,8 lx",null,null,null,null,null,null,null,null,null,null,null,null,187,null,null,null,"1011,9 lx",null,null,null,null,null,null,null,null,null,null,null,null,251,null,null,null,"1022,2 lx",null,null,null,null,null,null,null,null,null,null,null,null,315,null,null,null,"1013,6 lx"]
[60,null,null,null,"1004,7 lx",null,null,null,null,null,null,null,null,null,null,null,null,124,null,null,null,"1014,8 lx",null,null,null,null,null,null,null,null,null,null,null,null,188,null,null,null,"1009 lx",null,null,null,null,null,null,null,null,null,null,null,null,252,null,null,null,"1019,3 lx",null,null,null,null,null,null,null,null,null,null,null,null,316,null,null,null,"1013,9 lx"]
[61,null,null,null,"1022,2 lx",null,null,null,null,null,null,null,null,null,null,null,null,125,null,null,null,"1013,6 lx",null,null,null,null,null,null,null,null,null,null,null,null,189,null,null,null,"1007,1 lx",null,null,null,null,null,null,null,null,null,null,null,null,253,null,null,null,"1016,8 lx",null,null,null,null,null,null,null,null,null,null,null,null,317,null,null,null,"1011,9 lx"]
[62,null,null,null,"1019,3 lx",null,null,null,null,null,null,null,null,null,null,null,null,126,null,null,null,"1013,9 lx",null,null,null,null,null,null,null,null,null,null,null,null,190,null,null,null,"1004,7 lx",null,null,null,null,null,null,null,null,null,null,null,null,254,null,null,null,"1014,8 lx",null,null,null,null,null,null,null,null,null,null,null,null,318,null,null,null,"1009 lx"]
[63,null,null,null,"1016,8 lx",null,null,null,null,null,null,null,null,null,null,null,null,127,null,null,null,"1011,9 lx",null,null,null,null,null,null,null,null,null,null,null,null,191,null,null,null,"1022,2 lx",null,null,null,null,null,null,null,null,null,null,null,null,255,null,null,null,"1013,6 lx",null,null,null,null,null,null,null,null,null,null,null,null,319,null,null,null,"1007,1 lx"]
[64,null,null,null,"1014,8 lx",null,null,null,null,null,null,null,null,null,null,null,null,128,null,null,null,"1009 lx",null,null,null,null,null,null,null,null,null,null,null,null,192,null,null,null,"1019,3 lx",null,null,null,null,null,null,null,null,null,null,null,null,256,null,null,null,"1013,9 lx",null,null,null,null,null,null,null,null,null,null,null,null,320,null,null,null,"1004,7 lx"]
[null,null,null,null,null,null,null,null,null,null,null,null,null,null,null,null,null,null,null,null,null,null,null,null,null,null,null,null,null,null,null,null,null,null,null,null,null,null,null,null,null,null,null,null,null,null,null,null,null,null,null,null,null,null,null,null,null,null,null,null,null,null,null,null,null,null,null,null,null,null,null,null,null,null,null,null,null,null,null,null,null,null,null,null,null,null,null,null,null,{"$f":"IF(Data!$B$1=\"DE\",\"Seite\",IF(Data!$B$1=\"UK\",\"Page\",IF(Data!$B$1=\"FR\",\"Page\",\"Language Error\")))","v":"Seite"},null,null,null,null,null,null,2,null,"/",null,{"$f":"CW55","v":2}]
[{"$f":"IF(Data!$B$1=\"DE\",\"Messdaten\",IF(Data!$B$1=\"UK\",\"Measured data\",IF(Data!$B$1=\"FR\",\"données de mesure\",\"Language Error\")))","v":"Messdaten"},null,null,null,null,null,null,null,null,null,null,null,null,null,null,null,null,null,null,null,null,null,null,null,null,null,null,null,null,null,null,{"$f":"$W$4 & CHAR(10) & $W$6","v":"Dummyroom\n12345, Musterstadt"},null,null,null,null,null,null,null,null,null,null,null,null,null,null,null,null,null,null,null,null,null,null,null,null,null,null,null,null,null,null,null,null,null,null,null,null,null,null,null,null,null,null,null,null,null,null,null,null,null,null,{"$f":"$W$12","v":"04.04.2024, 13:08"}]
[]
[]
[]
[]
[]
[]
[]
[]
[]
[]
[]
[]
[]
[]
[]
[]
[]
[]
[]
[]
[]
[]
[]
[]
[]
[]
[]
[]
[]
[]
[]
[]
[]
[]
[]
[]
[]
[]
[]
[]
[]
[]
[]
[]
[]
[]
[]
[]
[]
[]
[]
[]
[]
[]
[]
[]
[]
[]
[]
[]
[]
[]
[]
[]
[]
[]
[null,null,null,null,null,null,null,null,null,null,null,null,null,null,null,null,null,null,null,null,null,null,null,null,null,null,null,null,null,null,null,null,null,null,null,null,null,null,null,null,null,null,null,null,null,null,null,null,null,null,null,null,null,null,null,null,null,null,null,null,null,null,null,null,null,null,null,null,null,null,null,null,null,null,null,null,null,null,null,null,null,null,null,null,null,null,null,null,null,{"$f":"IF(Data!$B$1=\"DE\",\"Seite\",IF(Data!$B$1=\"UK\",\"Page\",IF(Data!$B$1=\"FR\",\"Page\",\"Language Error\")))","v":"Seite"},null,null,null,null,null,null,3,null,"/",null,{"$f":"CW55","v":2}]
[{"$f":"IF(Data!$B$1=\"DE\",\"Messdaten\",IF(Data!$B$1=\"UK\",\"Measured data\",IF(Data!$B$1=\"FR\",\"données de mesure\",\"Language Error\")))","v":"Messdaten"},null,null,null,null,null,null,null,null,null,null,null,null,null,null,null,null,null,null,null,null,null,null,null,null,null,null,null,null,null,null,{"$f":"$W$4 & CHAR(10) & $W$6","v":"Dummyroom\n12345, Musterstadt"},null,null,null,null,null,null,null,null,null,null,null,null,null,null,null,null,null,null,null,null,null,null,null,null,null,null,null,null,null,null,null,null,null,null,null,null,null,null,null,null,null,null,null,null,null,null,null,null,null,null,{"$f":"$W$12","v":"04.04.2024, 13:08"}]
[]
[]
[]
[]
[]
[]
[]
[]
[]
[]
[]
[]
[]
[]
[]
[]
[]
[]
[]
[]
[]
[]
[]
[]
[]
[]
[]
[]
[]
[]
[]
[]
[]
[]
[]
[]
[]
[]
[]
[]
[]
[]
[]
[]
[]
[]
[]
[]
[]
[]
[]
[]
[]
[]
[]
[]
[]
[]
[]
[]
[]
[]
[]
[]
[]
[]
[null,null,null,null,null,null,null,null,null,null,null,null,null,null,null,null,null,null,null,null,null,null,null,null,null,null,null,null,null,null,null,null,null,null,null,null,null,null,null,null,null,null,null,null,null,null,null,null,null,null,null,null,null,null,null,null,null,null,null,null,null,null,null,null,null,null,null,null,null,null,null,null,null,null,null,null,null,null,null,null,null,null,null,null,null,null,null,null,null,{"$f":"IF(Data!$B$1=\"DE\",\"Seite\",IF(Data!$B$1=\"UK\",\"Page\",IF(Data!$B$1=\"FR\",\"Page\",\"Language Error\")))","v":"Seite"},null,null,null,null,null,null,4,null,"/",null,{"$f":"CW55","v":2}]

{"sheet":"Data","index":1,"n_rows":1321,"n_cols":25,"rows_kept":1321,"cut":false,"hidden":false,"merged":[]}
["Language:","DE",null,null,null,null,null,null,null,null,null,null,null,null,null,null,null,null,null,null,null,null,null,null,"DE"]
[]
[null,null,null,"Number of Values:",{"$f":"COUNT(B8:B9999)","v":372}]
["Gerät","GOSSEN MAVOMASTER mit MAVOPROBE 5032 B"]
["Seriennummer","24A12345 und 24A12346"]
["Firmware Rev.","1.0.5 und 1.0.6"]
[]
["E [lx]",1022.2,{"$f":"MID(A8,FIND(\"[\",A8)+1,999)","v":"lx]"},{"$f":"MID(C8,1,FIND(\"]\",C8)-1)","v":"lx"},{"$f":"IFERROR(D8,\"\")","v":"lx"}]
["E [lx]",1019.3,{"$f":"MID(A9,FIND(\"[\",A9)+1,999)","v":"lx]"},{"$f":"MID(C9,1,FIND(\"]\",C9)-1)","v":"lx"},{"$f":"IFERROR(D9,\"\")","v":"lx"}]
["E [lx]",1016.8,"lx]","lx","lx"]
["E [lx]",1014.8,"lx]","lx","lx"]
["E [lx]",1013.6,"lx]","lx","lx"]
["E [lx]",1013.9,"lx]","lx","lx"]
["E [lx]",1011.9,"lx]","lx","lx"]
["E [lx]",1009,"lx]","lx","lx"]
["E [lx]",1007.1,"lx]","lx","lx"]
["E [lx]",1004.7,"lx]","lx","lx"]
["E [lx]",1022.2,"lx]","lx","lx"]
["E [lx]",1019.3,"lx]","lx","lx"]
["E [lx]",1016.8,"lx]","lx","lx"]
["E [lx]",1014.8,"lx]","lx","lx"]
["E [lx]",1013.6,"lx]","lx","lx"]
["E [lx]",1013.9,"lx]","lx","lx"]
["E [lx]",1011.9,"lx]","lx","lx"]
["E [lx]",1009,"lx]","lx","lx"]
["E [lx]",1007.1,"lx]","lx","lx"]
["E [lx]",1004.7,"lx]","lx","lx"]
["E [lx]",1022.2,"lx]","lx","lx"]
["E [lx]",1019.3,"lx]","lx","lx"]
["E [lx]",1016.8,"lx]","lx","lx"]
["E [lx]",1014.8,"lx]","lx","lx"]
["E [lx]",1013.6,"lx]","lx","lx"]
["E [lx]",1013.9,"lx]","lx","lx"]
["E [lx]",1011.9,"lx]","lx","lx"]
["E [lx]",1009,"lx]","lx","lx"]
["E [lx]",1007.1,"lx]","lx","lx"]
["E [lx]",1004.7,"lx]","lx","lx"]
["E [lx]",1022.2,"lx]","lx","lx"]
["E [lx]",1019.3,"lx]","lx","lx"]
["E [lx]",1016.8,"lx]","lx","lx"]
["E [lx]",1014.8,"lx]","lx","lx"]
["E [lx]",1013.6,"lx]","lx","lx"]
["E [lx]",1013.9,"lx]","lx","lx"]
["E [lx]",1011.9,"lx]","lx","lx"]
["E [lx]",1009,"lx]","lx","lx"]
["E [lx]",1007.1,"lx]","lx","lx"]
["E [lx]",1004.7,"lx]","lx","lx"]
["E [lx]",1022.2,"lx]","lx","lx"]
["E [lx]",1019.3,"lx]","lx","lx"]
["E [lx]",1016.8,"lx]","lx","lx"]
["E [lx]",1014.8,"lx]","lx","lx"]
["E [lx]",1013.6,"lx]","lx","lx"]
["E [lx]",1013.9,"lx]","lx","lx"]
["E [lx]",1011.9,"lx]","lx","lx"]
["E [lx]",1009,"lx]","lx","lx"]
["E [lx]",1007.1,"lx]","lx","lx"]
["E [lx]",1004.7,"lx]","lx","lx"]
["E [lx]",1022.2,{"$f":"MID(A58,FIND(\"[\",A58)+1,999)","v":"lx]"},{"$f":"MID(C58,1,FIND(\"]\",C58)-1)","v":"lx"},{"$f":"IFERROR(D58,\"\")","v":"lx"}]
["E [lx]",1019.3,"lx]","lx","lx"]
["E [lx]",1016.8,"lx]","lx","lx"]
["E [lx]",1014.8,"lx]","lx","lx"]
["E [lx]",1013.6,"lx]","lx","lx"]
["E [lx]",1013.9,"lx]","lx","lx"]
["E [lx]",1011.9,"lx]","lx","lx"]
["E [lx]",1009,"lx]","lx","lx"]
["E [lx]",1007.1,"lx]","lx","lx"]
["E [lx]",1004.7,"lx]","lx","lx"]
["E [lx]",1022.2,"lx]","lx","lx"]
["E [lx]",1019.3,"lx]","lx","lx"]
["E [lx]",1016.8,"lx]","lx","lx"]
["E [lx]",1014.8,"lx]","lx","lx"]
["E [lx]",1013.6,"lx]","lx","lx"]
["E [lx]",1013.9,"lx]","lx","lx"]
["E [lx]",1011.9,"lx]","lx","lx"]
["E [lx]",1009,"lx]","lx","lx"]
["E [lx]",1007.1,"lx]","lx","lx"]
["E [lx]",1004.7,"lx]","lx","lx"]
["E [lx]",1022.2,"lx]","lx","lx"]
["E [lx]",1019.3,"lx]","lx","lx"]
["E [lx]",1016.8,"lx]","lx","lx"]
["E [lx]",1014.8,"lx]","lx","lx"]
["E [lx]",1013.6,"lx]","lx","lx"]
["E [lx]",1013.9,"lx]","lx","lx"]
["E [lx]",1011.9,"lx]","lx","lx"]
["E [lx]",1009,"lx]","lx","lx"]
["E [lx]",1007.1,"lx]","lx","lx"]
["E [lx]",1004.7,"lx]","lx","lx"]
["E [lx]",1022.2,"lx]","lx","lx"]
["E [lx]",1019.3,"lx]","lx","lx"]
["E [lx]",1016.8,"lx]","lx","lx"]
["E [lx]",1014.8,"lx]","lx","lx"]
["E [lx]",1013.6,"lx]","lx","lx"]
["E [lx]",1013.9,"lx]","lx","lx"]
["E [lx]",1011.9,"lx]","lx","lx"]
["E [lx]",1009,"lx]","lx","lx"]
["E [lx]",1007.1,"lx]","lx","lx"]
["E [lx]",1004.7,"lx]","lx","lx"]
["E [lx]",1022.2,"lx]","lx","lx"]
["E [lx]",1019.3,"lx]","lx","lx"]
["E [lx]",1016.8,"lx]","lx","lx"]
["E [lx]",1014.8,"lx]","lx","lx"]
["E [lx]",1013.6,"lx]","lx","lx"]
["E [lx]",1013.9,"lx]","lx","lx"]
["E [lx]",1011.9,"lx]","lx","lx"]
["E [lx]",1009,"lx]","lx","lx"]
["E [lx]",1007.1,"lx]","lx","lx"]
["E [lx]",1004.7,"lx]","lx","lx"]
["E [lx]",1022.2,"lx]","lx","lx"]
["E [lx]",1019.3,"lx]","lx","lx"]
["E [lx]",1016.8,"lx]","lx","lx"]
["E [lx]",1014.8,"lx]","lx","lx"]
["E [lx]",1013.6,"lx]","lx","lx"]
["E [lx]",1013.9,"lx]","lx","lx"]
["E [lx]",1011.9,"lx]","lx","lx"]
["E [lx]",1009,"lx]","lx","lx"]
["E [lx]",1007.1,"lx]","lx","lx"]
["E [lx]",1004.7,"lx]","lx","lx"]
["E [lx]",1022.2,"lx]","lx","lx"]
["E [lx]",1019.3,"lx]","lx","lx"]
["E [lx]",1016.8,"lx]","lx","lx"]
["E [lx]",1014.8,"lx]","lx","lx"]
["E [lx]",1013.6,{"$f":"MID(A122,FIND(\"[\",A122)+1,999)","v":"lx]"},{"$f":"MID(C122,1,FIND(\"]\",C122)-1)","v":"lx"},{"$f":"IFERROR(D122,\"\")","v":"lx"}]
["E [lx]",1013.9,"lx]","lx","lx"]
["E [lx]",1011.9,"lx]","lx","lx"]
["E [lx]",1009,"lx]","lx","lx"]
["E [lx]",1007.1,"lx]","lx","lx"]
["E [lx]",1004.7,"lx]","lx","lx"]
["E [lx]",1022.2,"lx]","lx","lx"]
["E [lx]",1019.3,"lx]","lx","lx"]
["E [lx]",1016.8,"lx]","lx","lx"]
["E [lx]",1014.8,"lx]","lx","lx"]
["E [lx]",1013.6,"lx]","lx","lx"]
["E [lx]",1013.9,"lx]","lx","lx"]
["E [lx]",1011.9,"lx]","lx","lx"]
["E [lx]",1009,"lx]","lx","lx"]
["E [lx]",1007.1,"lx]","lx","lx"]
["E [lx]",1004.7,"lx]","lx","lx"]
["E [lx]",1022.2,"lx]","lx","lx"]
["E [lx]",1019.3,"lx]","lx","lx"]
["E [lx]",1016.8,"lx]","lx","lx"]
["E [lx]",1014.8,"lx]","lx","lx"]
["E [lx]",1013.6,"lx]","lx","lx"]
["E [lx]",1013.9,"lx]","lx","lx"]
["E [lx]",1011.9,"lx]","lx","lx"]
["E [lx]",1009,"lx]","lx","lx"]
["E [lx]",1007.1,"lx]","lx","lx"]
["E [lx]",1004.7,"lx]","lx","lx"]
["E [lx]",1022.2,"lx]","lx","lx"]
["E [lx]",1019.3,"lx]","lx","lx"]
["E [lx]",1016.8,"lx]","lx","lx"]
["E [lx]",1014.8,"lx]","lx","lx"]
["E [lx]",1013.6,"lx]","lx","lx"]
["E [lx]",1013.9,"lx]","lx","lx"]
["E [lx]",1011.9,"lx]","lx","lx"]
["E [lx]",1009,"lx]","lx","lx"]
["E [lx]",1007.1,"lx]","lx","lx"]
["E [lx]",1004.7,"lx]","lx","lx"]
["E [lx]",1022.2,"lx]","lx","lx"]
["E [lx]",1019.3,"lx]","lx","lx"]
["E [lx]",1016.8,"lx]","lx","lx"]
["E [lx]",1014.8,"lx]","lx","lx"]
["E [lx]",1013.6,"lx]","lx","lx"]
["E [lx]",1013.9,"lx]","lx","lx"]
["E [lx]",1011.9,"lx]","lx","lx"]
["E [lx]",1009,"lx]","lx","lx"]
["E [lx]",1007.1,"lx]","lx","lx"]
["E [lx]",1004.7,"lx]","lx","lx"]
["E [lx]",1022.2,"lx]","lx","lx"]
["E [lx]",1019.3,"lx]","lx","lx"]
["E [lx]",1016.8,"lx]","lx","lx"]
["E [lx]",1014.8,"lx]","lx","lx"]
["E [lx]",1013.6,"lx]","lx","lx"]
["E [lx]",1013.9,"lx]","lx","lx"]
["E [lx]",1011.9,"lx]","lx","lx"]
["E [lx]",1009,"lx]","lx","lx"]
["E [lx]",1007.1,"lx]","lx","lx"]
["E [lx]",1004.7,"lx]","lx","lx"]
["E [lx]",1022.2,"lx]","lx","lx"]
["E [lx]",1019.3,"lx]","lx","lx"]
["E [lx]",1016.8,"lx]","lx","lx"]
["E [lx]",1014.8,"lx]","lx","lx"]
["E [lx]",1013.6,"lx]","lx","lx"]
["E [lx]",1013.9,"lx]","lx","lx"]
["E [lx]",1011.9,"lx]","lx","lx"]
["E [lx]",1009,"lx]","lx","lx"]
["E [lx]",1007.1,{"$f":"MID(A186,FIND(\"[\",A186)+1,999)","v":"lx]"},{"$f":"MID(C186,1,FIND(\"]\",C186)-1)","v":"lx"},{"$f":"IFERROR(D186,\"\")","v":"lx"}]
["E [lx]",1004.7,"lx]","lx","lx"]
["E [lx]",1022.2,"lx]","lx","lx"]
["E [lx]",1019.3,"lx]","lx","lx"]
["E [lx]",1016.8,"lx]","lx","lx"]
["E [lx]",1014.8,"lx]","lx","lx"]
["E [lx]",1013.6,"lx]","lx","lx"]
["E [lx]",1013.9,"lx]","lx","lx"]
["E [lx]",1011.9,"lx]","lx","lx"]
["E [lx]",1009,"lx]","lx","lx"]
["E [lx]",1007.1,"lx]","lx","lx"]
["E [lx]",1004.7,"lx]","lx","lx"]
["E [lx]",1022.2,"lx]","lx","lx"]
["E [lx]",1019.3,"lx]","lx","lx"]
["E [lx]",1016.8,"lx]","lx","lx"]
["E [lx]",1014.8,"lx]","lx","lx"]
["E [lx]",1013.6,"lx]","lx","lx"]
["E [lx]",1013.9,"lx]","lx","lx"]
["E [lx]",1011.9,"lx]","lx","lx"]
["E [lx]",1009,"lx]","lx","lx"]
["E [lx]",1007.1,"lx]","lx","lx"]
["E [lx]",1004.7,"lx]","lx","lx"]
["E [lx]",1022.2,"lx]","lx","lx"]
["E [lx]",1019.3,"lx]","lx","lx"]
["E [lx]",1016.8,"lx]","lx","lx"]
["E [lx]",1014.8,"lx]","lx","lx"]
["E [lx]",1013.6,"lx]","lx","lx"]
["E [lx]",1013.9,"lx]","lx","lx"]
["E [lx]",1011.9,"lx]","lx","lx"]
["E [lx]",1009,"lx]","lx","lx"]
["E [lx]",1007.1,"lx]","lx","lx"]
["E [lx]",1004.7,"lx]","lx","lx"]
["E [lx]",1022.2,"lx]","lx","lx"]
["E [lx]",1019.3,"lx]","lx","lx"]
["E [lx]",1016.8,"lx]","lx","lx"]
["E [lx]",1014.8,"lx]","lx","lx"]
["E [lx]",1013.6,"lx]","lx","lx"]
["E [lx]",1013.9,"lx]","lx","lx"]
["E [lx]",1011.9,"lx]","lx","lx"]
["E [lx]",1009,"lx]","lx","lx"]
["E [lx]",1007.1,"lx]","lx","lx"]
["E [lx]",1004.7,"lx]","lx","lx"]
["E [lx]",1022.2,"lx]","lx","lx"]
["E [lx]",1019.3,"lx]","lx","lx"]
["E [lx]",1016.8,"lx]","lx","lx"]
["E [lx]",1014.8,"lx]","lx","lx"]
["E [lx]",1013.6,"lx]","lx","lx"]
["E [lx]",1013.9,"lx]","lx","lx"]
["E [lx]",1011.9,"lx]","lx","lx"]
["E [lx]",1009,"lx]","lx","lx"]
["E [lx]",1007.1,"lx]","lx","lx"]
["E [lx]",1004.7,"lx]","lx","lx"]
["E [lx]",1022.2,"lx]","lx","lx"]
["E [lx]",1019.3,"lx]","lx","lx"]
["E [lx]",1016.8,"lx]","lx","lx"]
["E [lx]",1014.8,"lx]","lx","lx"]
["E [lx]",1013.6,"lx]","lx","lx"]
["E [lx]",1013.9,"lx]","lx","lx"]
["E [lx]",1011.9,"lx]","lx","lx"]
["E [lx]",1009,"lx]","lx","lx"]
["E [lx]",1007.1,"lx]","lx","lx"]
["E [lx]",1004.7,"lx]","lx","lx"]
["E [lx]",1022.2,"lx]","lx","lx"]
["E [lx]",1019.3,"lx]","lx","lx"]
["E [lx]",1016.8,{"$f":"MID(A250,FIND(\"[\",A250)+1,999)","v":"lx]"},{"$f":"MID(C250,1,FIND(\"]\",C250)-1)","v":"lx"},{"$f":"IFERROR(D250,\"\")","v":"lx"}]
["E [lx]",1014.8,"lx]","lx","lx"]
["E [lx]",1013.6,"lx]","lx","lx"]
["E [lx]",1013.9,"lx]","lx","lx"]
["E [lx]",1011.9,"lx]","lx","lx"]
["E [lx]",1009,"lx]","lx","lx"]
["E [lx]",1007.1,"lx]","lx","lx"]
["E [lx]",1004.7,"lx]","lx","lx"]
["E [lx]",1022.2,"lx]","lx","lx"]
["E [lx]",1019.3,"lx]","lx","lx"]
["E [lx]",1016.8,"lx]","lx","lx"]
["E [lx]",1014.8,"lx]","lx","lx"]
["E [lx]",1013.6,"lx]","lx","lx"]
["E [lx]",1013.9,"lx]","lx","lx"]
["E [lx]",1011.9,"lx]","lx","lx"]
["E [lx]",1009,"lx]","lx","lx"]
["E [lx]",1007.1,"lx]","lx","lx"]
["E [lx]",1004.7,"lx]","lx","lx"]
["E [lx]",1022.2,"lx]","lx","lx"]
["E [lx]",1019.3,"lx]","lx","lx"]
["E [lx]",1016.8,"lx]","lx","lx"]
["E [lx]",1014.8,"lx]","lx","lx"]
["E [lx]",1013.6,"lx]","lx","lx"]
["E [lx]",1013.9,"lx]","lx","lx"]
["E [lx]",1011.9,"lx]","lx","lx"]
["E [lx]",1009,"lx]","lx","lx"]
["E [lx]",1007.1,"lx]","lx","lx"]
["E [lx]",1004.7,"lx]","lx","lx"]
["E [lx]",1022.2,"lx]","lx","lx"]
["E [lx]",1019.3,"lx]","lx","lx"]
["E [lx]",1016.8,"lx]","lx","lx"]
["E [lx]",1014.8,"lx]","lx","lx"]
["E [lx]",1013.6,"lx]","lx","lx"]
["E [lx]",1013.9,"lx]","lx","lx"]
["E [lx]",1011.9,"lx]","lx","lx"]
["E [lx]",1009,"lx]","lx","lx"]
["E [lx]",1007.1,"lx]","lx","lx"]
["E [lx]",1004.7,"lx]","lx","lx"]
["E [lx]",1022.2,"lx]","lx","lx"]
["E [lx]",1019.3,"lx]","lx","lx"]
["E [lx]",1016.8,"lx]","lx","lx"]
["E [lx]",1014.8,"lx]","lx","lx"]
["E [lx]",1013.6,"lx]","lx","lx"]
["E [lx]",1013.9,"lx]","lx","lx"]
["E [lx]",1011.9,"lx]","lx","lx"]
["E [lx]",1009,"lx]","lx","lx"]
["E [lx]",1007.1,"lx]","lx","lx"]
["E [lx]",1004.7,"lx]","lx","lx"]
["E [lx]",1022.2,"lx]","lx","lx"]
["E [lx]",1019.3,"lx]","lx","lx"]
["E [lx]",1016.8,"lx]","lx","lx"]
["E [lx]",1014.8,"lx]","lx","lx"]
["E [lx]",1013.6,"lx]","lx","lx"]
["E [lx]",1013.9,"lx]","lx","lx"]
["E [lx]",1011.9,"lx]","lx","lx"]
["E [lx]",1009,"lx]","lx","lx"]
["E [lx]",1007.1,"lx]","lx","lx"]
["E [lx]",1004.7,"lx]","lx","lx"]
["E [lx]",1022.2,"lx]","lx","lx"]
["E [lx]",1019.3,"lx]","lx","lx"]
["E [lx]",1016.8,"lx]","lx","lx"]
["E [lx]",1014.8,"lx]","lx","lx"]
["E [lx]",1013.6,"lx]","lx","lx"]
["E [lx]",1013.9,"lx]","lx","lx"]
["E [lx]",1011.9,{"$f":"MID(A314,FIND(\"[\",A314)+1,999)","v":"lx]"},{"$f":"MID(C314,1,FIND(\"]\",C314)-1)","v":"lx"},{"$f":"IFERROR(D314,\"\")","v":"lx"}]
["E [lx]",1009,"lx]","lx","lx"]
["E [lx]",1007.1,"lx]","lx","lx"]
["E [lx]",1004.7,"lx]","lx","lx"]
["E [lx]",1022.2,"lx]","lx","lx"]
["E [lx]",1019.3,"lx]","lx","lx"]
["E [lx]",1016.8,"lx]","lx","lx"]
["E [lx]",1014.8,"lx]","lx","lx"]
["E [lx]",1013.6,"lx]","lx","lx"]
["E [lx]",1013.9,"lx]","lx","lx"]
["E [lx]",1011.9,"lx]","lx","lx"]
["E [lx]",1009,"lx]","lx","lx"]
["E [lx]",1007.1,"lx]","lx","lx"]
["E [lx]",1004.7,"lx]","lx","lx"]
["E [lx]",1022.2,"lx]","lx","lx"]
["E [lx]",1019.3,"lx]","lx","lx"]
["E [lx]",1016.8,"lx]","lx","lx"]
["E [lx]",1014.8,"lx]","lx","lx"]
["E [lx]",1013.6,"lx]","lx","lx"]
["E [lx]",1013.9,"lx]","lx","lx"]
["E [lx]",1011.9,"lx]","lx","lx"]
["E [lx]",1009,"lx]","lx","lx"]
["E [lx]",1007.1,"lx]","lx","lx"]
["E [lx]",1004.7,"lx]","lx","lx"]
["E [lx]",1022.2,"lx]","lx","lx"]
["E [lx]",1019.3,"lx]","lx","lx"]
["E [lx]",1016.8,"lx]","lx","lx"]
["E [lx]",1014.8,"lx]","lx","lx"]
["E [lx]",1013.6,"lx]","lx","lx"]
["E [lx]",1013.9,"lx]","lx","lx"]
["E [lx]",1011.9,"lx]","lx","lx"]
["E [lx]",1009,"lx]","lx","lx"]
["E [lx]",1007.1,"lx]","lx","lx"]
["E [lx]",1004.7,"lx]","lx","lx"]
["E [lx]",1022.2,"lx]","lx","lx"]
["E [lx]",1019.3,"lx]","lx","lx"]
["E [lx]",1016.8,"lx]","lx","lx"]
["E [lx]",1014.8,"lx]","lx","lx"]
["E [lx]",1013.6,"lx]","lx","lx"]
["E [lx]",1013.9,"lx]","lx","lx"]
["E [lx]",1011.9,"lx]","lx","lx"]
["E [lx]",1009,"lx]","lx","lx"]
["E [lx]",1007.1,"lx]","lx","lx"]
["E [lx]",1004.7,"lx]","lx","lx"]
["E [lx]",1022.2,"lx]","lx","lx"]
["E [lx]",1019.3,"lx]","lx","lx"]
["E [lx]",1016.8,"lx]","lx","lx"]
["E [lx]",1014.8,"lx]","lx","lx"]
["E [lx]",1013.6,"lx]","lx","lx"]
["E [lx]",1013.9,"lx]","lx","lx"]
["E [lx]",1011.9,"lx]","lx","lx"]
["E [lx]",1009,"lx]","lx","lx"]
["E [lx]",1007.1,"lx]","lx","lx"]
["E [lx]",1004.7,"lx]","lx","lx"]
["E [lx]",1022.2,"lx]","lx","lx"]
["E [lx]",1019.3,"lx]","lx","lx"]
["E [lx]",1016.8,"lx]","lx","lx"]
["E [lx]",1014.8,"lx]","lx","lx"]
["E [lx]",1013.6,"lx]","lx","lx"]
["E [lx]",1013.9,"lx]","lx","lx"]
["E [lx]",1011.9,"lx]","lx","lx"]
["E [lx]",1009,"lx]","lx","lx"]
["E [lx]",1007.1,"lx]","lx","lx"]
["E [lx]",1004.7,"lx]","lx","lx"]
["E [lx]",1022.2,{"$f":"MID(A378,FIND(\"[\",A378)+1,999)","v":"lx]"},{"$f":"MID(C378,1,FIND(\"]\",C378)-1)","v":"lx"},{"$f":"IFERROR(D378,\"\")","v":"lx"}]
["E [lx]",1019.3,"lx]","lx","lx"]
[null,null,{"$error":"#VALUE!"},{"$error":"#VALUE!"},""]
[null,null,{"$error":"#VALUE!"},{"$error":"#VALUE!"},""]
[null,null,{"$error":"#VALUE!"},{"$error":"#VALUE!"},""]
[null,null,{"$error":"#VALUE!"},{"$error":"#VALUE!"},""]
[null,null,{"$error":"#VALUE!"},{"$error":"#VALUE!"},""]
[null,null,{"$error":"#VALUE!"},{"$error":"#VALUE!"},""]
[null,null,{"$error":"#VALUE!"},{"$error":"#VALUE!"},""]
[null,null,{"$error":"#VALUE!"},{"$error":"#VALUE!"},""]
[null,null,{"$error":"#VALUE!"},{"$error":"#VALUE!"},""]
[null,null,{"$error":"#VALUE!"},{"$error":"#VALUE!"},""]
[null,null,{"$error":"#VALUE!"},{"$error":"#VALUE!"},""]
[null,null,{"$error":"#VALUE!"},{"$error":"#VALUE!"},""]
[null,null,{"$error":"#VALUE!"},{"$error":"#VALUE!"},""]
[null,null,{"$error":"#VALUE!"},{"$error":"#VALUE!"},""]
[null,null,{"$error":"#VALUE!"},{"$error":"#VALUE!"},""]
[null,null,{"$error":"#VALUE!"},{"$error":"#VALUE!"},""]
[null,null,{"$error":"#VALUE!"},{"$error":"#VALUE!"},""]
[null,null,{"$error":"#VALUE!"},{"$error":"#VALUE!"},""]
[null,null,{"$error":"#VALUE!"},{"$error":"#VALUE!"},""]
[null,null,{"$error":"#VALUE!"},{"$error":"#VALUE!"},""]
[null,null,{"$error":"#VALUE!"},{"$error":"#VALUE!"},""]
[null,null,{"$error":"#VALUE!"},{"$error":"#VALUE!"},""]
[null,null,{"$error":"#VALUE!"},{"$error":"#VALUE!"},""]
[null,null,{"$error":"#VALUE!"},{"$error":"#VALUE!"},""]
[null,null,{"$error":"#VALUE!"},{"$error":"#VALUE!"},""]
[null,null,{"$error":"#VALUE!"},{"$error":"#VALUE!"},""]
[null,null,{"$error":"#VALUE!"},{"$error":"#VALUE!"},""]
[null,null,{"$error":"#VALUE!"},{"$error":"#VALUE!"},""]
[null,null,{"$error":"#VALUE!"},{"$error":"#VALUE!"},""]
[null,null,{"$error":"#VALUE!"},{"$error":"#VALUE!"},""]
[null,null,{"$error":"#VALUE!"},{"$error":"#VALUE!"},""]
[null,null,{"$error":"#VALUE!"},{"$error":"#VALUE!"},""]
[null,null,{"$error":"#VALUE!"},{"$error":"#VALUE!"},""]
[null,null,{"$error":"#VALUE!"},{"$error":"#VALUE!"},""]
[null,null,{"$error":"#VALUE!"},{"$error":"#VALUE!"},""]
[null,null,{"$error":"#VALUE!"},{"$error":"#VALUE!"},""]
[null,null,{"$error":"#VALUE!"},{"$error":"#VALUE!"},""]
[null,null,{"$error":"#VALUE!"},{"$error":"#VALUE!"},""]
[null,null,{"$error":"#VALUE!"},{"$error":"#VALUE!"},""]
[null,null,{"$error":"#VALUE!"},{"$error":"#VALUE!"},""]
[null,null,{"$error":"#VALUE!"},{"$error":"#VALUE!"},""]
[null,null,{"$error":"#VALUE!"},{"$error":"#VALUE!"},""]
[null,null,{"$error":"#VALUE!"},{"$error":"#VALUE!"},""]
[null,null,{"$error":"#VALUE!"},{"$error":"#VALUE!"},""]
[null,null,{"$error":"#VALUE!"},{"$error":"#VALUE!"},""]
[null,null,{"$error":"#VALUE!"},{"$error":"#VALUE!"},""]
[null,null,{"$error":"#VALUE!"},{"$error":"#VALUE!"},""]
[null,null,{"$error":"#VALUE!"},{"$error":"#VALUE!"},""]
[null,null,{"$error":"#VALUE!"},{"$error":"#VALUE!"},""]
[null,null,{"$error":"#VALUE!"},{"$error":"#VALUE!"},""]
[null,null,{"$error":"#VALUE!"},{"$error":"#VALUE!"},""]
[null,null,{"$error":"#VALUE!"},{"$error":"#VALUE!"},""]
[null,null,{"$error":"#VALUE!"},{"$error":"#VALUE!"},""]
[null,null,{"$error":"#VALUE!"},{"$error":"#VALUE!"},""]
[null,null,{"$error":"#VALUE!"},{"$error":"#VALUE!"},""]
[null,null,{"$error":"#VALUE!"},{"$error":"#VALUE!"},""]
[null,null,{"$error":"#VALUE!"},{"$error":"#VALUE!"},""]
[null,null,{"$error":"#VALUE!"},{"$error":"#VALUE!"},""]
[null,null,{"$error":"#VALUE!"},{"$error":"#VALUE!"},""]
[null,null,{"$error":"#VALUE!"},{"$error":"#VALUE!"},""]
[null,null,{"$error":"#VALUE!"},{"$error":"#VALUE!"},""]
[null,null,{"$error":"#VALUE!"},{"$error":"#VALUE!"},""]
[null,null,{"$f":"MID(A442,FIND(\"[\",A442)+1,999)","v":{"$error":"#VALUE!"}},{"$f":"MID(C442,1,FIND(\"]\",C442)-1)","v":{"$error":"#VALUE!"}},{"$f":"IFERROR(D442,\"\")","v":""}]
[null,null,{"$error":"#VALUE!"},{"$error":"#VALUE!"},""]
[null,null,{"$error":"#VALUE!"},{"$error":"#VALUE!"},""]
[null,null,{"$error":"#VALUE!"},{"$error":"#VALUE!"},""]
[null,null,{"$error":"#VALUE!"},{"$error":"#VALUE!"},""]
[null,null,{"$error":"#VALUE!"},{"$error":"#VALUE!"},""]
[null,null,{"$error":"#VALUE!"},{"$error":"#VALUE!"},""]
[null,null,{"$error":"#VALUE!"},{"$error":"#VALUE!"},""]
[null,null,{"$error":"#VALUE!"},{"$error":"#VALUE!"},""]
[null,null,{"$error":"#VALUE!"},{"$error":"#VALUE!"},""]
[null,null,{"$error":"#VALUE!"},{"$error":"#VALUE!"},""]
[null,null,{"$error":"#VALUE!"},{"$error":"#VALUE!"},""]
[null,null,{"$error":"#VALUE!"},{"$error":"#VALUE!"},""]
[null,null,{"$error":"#VALUE!"},{"$error":"#VALUE!"},""]
[null,null,{"$error":"#VALUE!"},{"$error":"#VALUE!"},""]
[null,null,{"$error":"#VALUE!"},{"$error":"#VALUE!"},""]
[null,null,{"$error":"#VALUE!"},{"$error":"#VALUE!"},""]
[null,null,{"$error":"#VALUE!"},{"$error":"#VALUE!"},""]
[null,null,{"$error":"#VALUE!"},{"$error":"#VALUE!"},""]
[null,null,{"$error":"#VALUE!"},{"$error":"#VALUE!"},""]
[null,null,{"$error":"#VALUE!"},{"$error":"#VALUE!"},""]
[null,null,{"$error":"#VALUE!"},{"$error":"#VALUE!"},""]
[null,null,{"$error":"#VALUE!"},{"$error":"#VALUE!"},""]
[null,null,{"$error":"#VALUE!"},{"$error":"#VALUE!"},""]
[null,null,{"$error":"#VALUE!"},{"$error":"#VALUE!"},""]
[null,null,{"$error":"#VALUE!"},{"$error":"#VALUE!"},""]
[null,null,{"$error":"#VALUE!"},{"$error":"#VALUE!"},""]
[null,null,{"$error":"#VALUE!"},{"$error":"#VALUE!"},""]
[null,null,{"$error":"#VALUE!"},{"$error":"#VALUE!"},""]
[null,null,{"$error":"#VALUE!"},{"$error":"#VALUE!"},""]
[null,null,{"$error":"#VALUE!"},{"$error":"#VALUE!"},""]
[null,null,{"$error":"#VALUE!"},{"$error":"#VALUE!"},""]
[null,null,{"$error":"#VALUE!"},{"$error":"#VALUE!"},""]
[null,null,{"$error":"#VALUE!"},{"$error":"#VALUE!"},""]
[null,null,{"$error":"#VALUE!"},{"$error":"#VALUE!"},""]
[null,null,{"$error":"#VALUE!"},{"$error":"#VALUE!"},""]
[null,null,{"$error":"#VALUE!"},{"$error":"#VALUE!"},""]
[null,null,{"$error":"#VALUE!"},{"$error":"#VALUE!"},""]
[null,null,{"$error":"#VALUE!"},{"$error":"#VALUE!"},""]
[null,null,{"$error":"#VALUE!"},{"$error":"#VALUE!"},""]
[null,null,{"$error":"#VALUE!"},{"$error":"#VALUE!"},""]
[null,null,{"$error":"#VALUE!"},{"$error":"#VALUE!"},""]
[null,null,{"$error":"#VALUE!"},{"$error":"#VALUE!"},""]
[null,null,{"$error":"#VALUE!"},{"$error":"#VALUE!"},""]
[null,null,{"$error":"#VALUE!"},{"$error":"#VALUE!"},""]
[null,null,{"$error":"#VALUE!"},{"$error":"#VALUE!"},""]
[null,null,{"$error":"#VALUE!"},{"$error":"#VALUE!"},""]
[null,null,{"$error":"#VALUE!"},{"$error":"#VALUE!"},""]
[null,null,{"$error":"#VALUE!"},{"$error":"#VALUE!"},""]
[null,null,{"$error":"#VALUE!"},{"$error":"#VALUE!"},""]
[null,null,{"$error":"#VALUE!"},{"$error":"#VALUE!"},""]
[null,null,{"$error":"#VALUE!"},{"$error":"#VALUE!"},""]
[null,null,{"$error":"#VALUE!"},{"$error":"#VALUE!"},""]
[null,null,{"$error":"#VALUE!"},{"$error":"#VALUE!"},""]
[null,null,{"$error":"#VALUE!"},{"$error":"#VALUE!"},""]
[null,null,{"$error":"#VALUE!"},{"$error":"#VALUE!"},""]
[null,null,{"$error":"#VALUE!"},{"$error":"#VALUE!"},""]
[null,null,{"$error":"#VALUE!"},{"$error":"#VALUE!"},""]
[null,null,{"$error":"#VALUE!"},{"$error":"#VALUE!"},""]
[null,null,{"$error":"#VALUE!"},{"$error":"#VALUE!"},""]
[null,null,{"$error":"#VALUE!"},{"$error":"#VALUE!"},""]
[null,null,{"$error":"#VALUE!"},{"$error":"#VALUE!"},""]
[null,null,{"$error":"#VALUE!"},{"$error":"#VALUE!"},""]
[null,null,{"$error":"#VALUE!"},{"$error":"#VALUE!"},""]
[null,null,{"$f":"MID(A506,FIND(\"[\",A506)+1,999)","v":{"$error":"#VALUE!"}},{"$f":"MID(C506,1,FIND(\"]\",C506)-1)","v":{"$error":"#VALUE!"}},{"$f":"IFERROR(D506,\"\")","v":""}]
[null,null,{"$error":"#VALUE!"},{"$error":"#VALUE!"},""]
[null,null,{"$error":"#VALUE!"},{"$error":"#VALUE!"},""]
[null,null,{"$error":"#VALUE!"},{"$error":"#VALUE!"},""]
[null,null,{"$error":"#VALUE!"},{"$error":"#VALUE!"},""]
[null,null,{"$error":"#VALUE!"},{"$error":"#VALUE!"},""]
[null,null,{"$error":"#VALUE!"},{"$error":"#VALUE!"},""]
[null,null,{"$error":"#VALUE!"},{"$error":"#VALUE!"},""]
[null,null,{"$error":"#VALUE!"},{"$error":"#VALUE!"},""]
[null,null,{"$error":"#VALUE!"},{"$error":"#VALUE!"},""]
[null,null,{"$error":"#VALUE!"},{"$error":"#VALUE!"},""]
[null,null,{"$error":"#VALUE!"},{"$error":"#VALUE!"},""]
[null,null,{"$error":"#VALUE!"},{"$error":"#VALUE!"},""]
[null,null,{"$error":"#VALUE!"},{"$error":"#VALUE!"},""]
[null,null,{"$error":"#VALUE!"},{"$error":"#VALUE!"},""]
[null,null,{"$error":"#VALUE!"},{"$error":"#VALUE!"},""]
[null,null,{"$error":"#VALUE!"},{"$error":"#VALUE!"},""]
[null,null,{"$error":"#VALUE!"},{"$error":"#VALUE!"},""]
[null,null,{"$error":"#VALUE!"},{"$error":"#VALUE!"},""]
[null,null,{"$error":"#VALUE!"},{"$error":"#VALUE!"},""]
[null,null,{"$error":"#VALUE!"},{"$error":"#VALUE!"},""]
[null,null,{"$error":"#VALUE!"},{"$error":"#VALUE!"},""]
[null,null,{"$error":"#VALUE!"},{"$error":"#VALUE!"},""]
[null,null,{"$error":"#VALUE!"},{"$error":"#VALUE!"},""]
[null,null,{"$error":"#VALUE!"},{"$error":"#VALUE!"},""]
[null,null,{"$error":"#VALUE!"},{"$error":"#VALUE!"},""]
[null,null,{"$error":"#VALUE!"},{"$error":"#VALUE!"},""]
[null,null,{"$error":"#VALUE!"},{"$error":"#VALUE!"},""]
[null,null,{"$error":"#VALUE!"},{"$error":"#VALUE!"},""]
[null,null,{"$error":"#VALUE!"},{"$error":"#VALUE!"},""]
[null,null,{"$error":"#VALUE!"},{"$error":"#VALUE!"},""]
[null,null,{"$error":"#VALUE!"},{"$error":"#VALUE!"},""]
[null,null,{"$error":"#VALUE!"},{"$error":"#VALUE!"},""]
[null,null,{"$error":"#VALUE!"},{"$error":"#VALUE!"},""]
[null,null,{"$error":"#VALUE!"},{"$error":"#VALUE!"},""]
[null,null,{"$error":"#VALUE!"},{"$error":"#VALUE!"},""]
[null,null,{"$error":"#VALUE!"},{"$error":"#VALUE!"},""]
[null,null,{"$error":"#VALUE!"},{"$error":"#VALUE!"},""]
[null,null,{"$error":"#VALUE!"},{"$error":"#VALUE!"},""]
[null,null,{"$error":"#VALUE!"},{"$error":"#VALUE!"},""]
[null,null,{"$error":"#VALUE!"},{"$error":"#VALUE!"},""]
[null,null,{"$error":"#VALUE!"},{"$error":"#VALUE!"},""]
[null,null,{"$error":"#VALUE!"},{"$error":"#VALUE!"},""]
[null,null,{"$error":"#VALUE!"},{"$error":"#VALUE!"},""]
[null,null,{"$error":"#VALUE!"},{"$error":"#VALUE!"},""]
[null,null,{"$error":"#VALUE!"},{"$error":"#VALUE!"},""]
[null,null,{"$error":"#VALUE!"},{"$error":"#VALUE!"},""]
[null,null,{"$error":"#VALUE!"},{"$error":"#VALUE!"},""]
[null,null,{"$error":"#VALUE!"},{"$error":"#VALUE!"},""]
[null,null,{"$error":"#VALUE!"},{"$error":"#VALUE!"},""]
[null,null,{"$error":"#VALUE!"},{"$error":"#VALUE!"},""]
[null,null,{"$error":"#VALUE!"},{"$error":"#VALUE!"},""]
[null,null,{"$error":"#VALUE!"},{"$error":"#VALUE!"},""]
[null,null,{"$error":"#VALUE!"},{"$error":"#VALUE!"},""]
[null,null,{"$error":"#VALUE!"},{"$error":"#VALUE!"},""]
[null,null,{"$error":"#VALUE!"},{"$error":"#VALUE!"},""]
[null,null,{"$error":"#VALUE!"},{"$error":"#VALUE!"},""]
[null,null,{"$error":"#VALUE!"},{"$error":"#VALUE!"},""]
[null,null,{"$error":"#VALUE!"},{"$error":"#VALUE!"},""]
[null,null,{"$error":"#VALUE!"},{"$error":"#VALUE!"},""]
[null,null,{"$error":"#VALUE!"},{"$error":"#VALUE!"},""]
[null,null,{"$error":"#VALUE!"},{"$error":"#VALUE!"},""]
[null,null,{"$error":"#VALUE!"},{"$error":"#VALUE!"},""]
[null,null,{"$error":"#VALUE!"},{"$error":"#VALUE!"},""]
[null,null,{"$f":"MID(A570,FIND(\"[\",A570)+1,999)","v":{"$error":"#VALUE!"}},{"$f":"MID(C570,1,FIND(\"]\",C570)-1)","v":{"$error":"#VALUE!"}},{"$f":"IFERROR(D570,\"\")","v":""}]
[null,null,{"$error":"#VALUE!"},{"$error":"#VALUE!"},""]
[null,null,{"$error":"#VALUE!"},{"$error":"#VALUE!"},""]
[null,null,{"$error":"#VALUE!"},{"$error":"#VALUE!"},""]
[null,null,{"$error":"#VALUE!"},{"$error":"#VALUE!"},""]
[null,null,{"$error":"#VALUE!"},{"$error":"#VALUE!"},""]
[null,null,{"$error":"#VALUE!"},{"$error":"#VALUE!"},""]
[null,null,{"$error":"#VALUE!"},{"$error":"#VALUE!"},""]
[null,null,{"$error":"#VALUE!"},{"$error":"#VALUE!"},""]
[null,null,{"$error":"#VALUE!"},{"$error":"#VALUE!"},""]
[null,null,{"$error":"#VALUE!"},{"$error":"#VALUE!"},""]
[null,null,{"$error":"#VALUE!"},{"$error":"#VALUE!"},""]
[null,null,{"$error":"#VALUE!"},{"$error":"#VALUE!"},""]
[null,null,{"$error":"#VALUE!"},{"$error":"#VALUE!"},""]
[null,null,{"$error":"#VALUE!"},{"$error":"#VALUE!"},""]
[null,null,{"$error":"#VALUE!"},{"$error":"#VALUE!"},""]
[null,null,{"$error":"#VALUE!"},{"$error":"#VALUE!"},""]
[null,null,{"$error":"#VALUE!"},{"$error":"#VALUE!"},""]
[null,null,{"$error":"#VALUE!"},{"$error":"#VALUE!"},""]
[null,null,{"$error":"#VALUE!"},{"$error":"#VALUE!"},""]
[null,null,{"$error":"#VALUE!"},{"$error":"#VALUE!"},""]
[null,null,{"$error":"#VALUE!"},{"$error":"#VALUE!"},""]
[null,null,{"$error":"#VALUE!"},{"$error":"#VALUE!"},""]
[null,null,{"$error":"#VALUE!"},{"$error":"#VALUE!"},""]
[null,null,{"$error":"#VALUE!"},{"$error":"#VALUE!"},""]
[null,null,{"$error":"#VALUE!"},{"$error":"#VALUE!"},""]
[null,null,{"$error":"#VALUE!"},{"$error":"#VALUE!"},""]
[null,null,{"$error":"#VALUE!"},{"$error":"#VALUE!"},""]
[null,null,{"$error":"#VALUE!"},{"$error":"#VALUE!"},""]
[null,null,{"$error":"#VALUE!"},{"$error":"#VALUE!"},""]
[null,null,{"$error":"#VALUE!"},{"$error":"#VALUE!"},""]
[null,null,{"$error":"#VALUE!"},{"$error":"#VALUE!"},""]
[null,null,{"$error":"#VALUE!"},{"$error":"#VALUE!"},""]
[null,null,{"$error":"#VALUE!"},{"$error":"#VALUE!"},""]
[null,null,{"$error":"#VALUE!"},{"$error":"#VALUE!"},""]
[null,null,{"$error":"#VALUE!"},{"$error":"#VALUE!"},""]
[null,null,{"$error":"#VALUE!"},{"$error":"#VALUE!"},""]
[null,null,{"$error":"#VALUE!"},{"$error":"#VALUE!"},""]
[null,null,{"$error":"#VALUE!"},{"$error":"#VALUE!"},""]
[null,null,{"$error":"#VALUE!"},{"$error":"#VALUE!"},""]
[null,null,{"$error":"#VALUE!"},{"$error":"#VALUE!"},""]
[null,null,{"$error":"#VALUE!"},{"$error":"#VALUE!"},""]
[null,null,{"$error":"#VALUE!"},{"$error":"#VALUE!"},""]
[null,null,{"$error":"#VALUE!"},{"$error":"#VALUE!"},""]
[null,null,{"$error":"#VALUE!"},{"$error":"#VALUE!"},""]
[null,null,{"$error":"#VALUE!"},{"$error":"#VALUE!"},""]
[null,null,{"$error":"#VALUE!"},{"$error":"#VALUE!"},""]
[null,null,{"$error":"#VALUE!"},{"$error":"#VALUE!"},""]
[null,null,{"$error":"#VALUE!"},{"$error":"#VALUE!"},""]
[null,null,{"$error":"#VALUE!"},{"$error":"#VALUE!"},""]
[null,null,{"$error":"#VALUE!"},{"$error":"#VALUE!"},""]
[null,null,{"$error":"#VALUE!"},{"$error":"#VALUE!"},""]
[null,null,{"$error":"#VALUE!"},{"$error":"#VALUE!"},""]
[null,null,{"$error":"#VALUE!"},{"$error":"#VALUE!"},""]
[null,null,{"$error":"#VALUE!"},{"$error":"#VALUE!"},""]
[null,null,{"$error":"#VALUE!"},{"$error":"#VALUE!"},""]
[null,null,{"$error":"#VALUE!"},{"$error":"#VALUE!"},""]
[null,null,{"$error":"#VALUE!"},{"$error":"#VALUE!"},""]
[null,null,{"$error":"#VALUE!"},{"$error":"#VALUE!"},""]
[null,null,{"$error":"#VALUE!"},{"$error":"#VALUE!"},""]
[null,null,{"$error":"#VALUE!"},{"$error":"#VALUE!"},""]
[null,null,{"$error":"#VALUE!"},{"$error":"#VALUE!"},""]
[null,null,{"$error":"#VALUE!"},{"$error":"#VALUE!"},""]
[null,null,{"$error":"#VALUE!"},{"$error":"#VALUE!"},""]
[null,null,{"$f":"MID(A634,FIND(\"[\",A634)+1,999)","v":{"$error":"#VALUE!"}},{"$f":"MID(C634,1,FIND(\"]\",C634)-1)","v":{"$error":"#VALUE!"}},{"$f":"IFERROR(D634,\"\")","v":""}]
[null,null,{"$error":"#VALUE!"},{"$error":"#VALUE!"},""]
[null,null,{"$error":"#VALUE!"},{"$error":"#VALUE!"},""]
[null,null,{"$error":"#VALUE!"},{"$error":"#VALUE!"},""]
[null,null,{"$error":"#VALUE!"},{"$error":"#VALUE!"},""]
[null,null,{"$error":"#VALUE!"},{"$error":"#VALUE!"},""]
[null,null,{"$error":"#VALUE!"},{"$error":"#VALUE!"},""]
[null,null,{"$error":"#VALUE!"},{"$error":"#VALUE!"},""]
[null,null,{"$error":"#VALUE!"},{"$error":"#VALUE!"},""]
[null,null,{"$error":"#VALUE!"},{"$error":"#VALUE!"},""]
[null,null,{"$error":"#VALUE!"},{"$error":"#VALUE!"},""]
[null,null,{"$error":"#VALUE!"},{"$error":"#VALUE!"},""]
[null,null,{"$error":"#VALUE!"},{"$error":"#VALUE!"},""]
[null,null,{"$error":"#VALUE!"},{"$error":"#VALUE!"},""]
[null,null,{"$error":"#VALUE!"},{"$error":"#VALUE!"},""]
[null,null,{"$error":"#VALUE!"},{"$error":"#VALUE!"},""]
[null,null,{"$error":"#VALUE!"},{"$error":"#VALUE!"},""]
[null,null,{"$error":"#VALUE!"},{"$error":"#VALUE!"},""]
[null,null,{"$error":"#VALUE!"},{"$error":"#VALUE!"},""]
[null,null,{"$error":"#VALUE!"},{"$error":"#VALUE!"},""]
[null,null,{"$error":"#VALUE!"},{"$error":"#VALUE!"},""]
[null,null,{"$error":"#VALUE!"},{"$error":"#VALUE!"},""]
[null,null,{"$error":"#VALUE!"},{"$error":"#VALUE!"},""]
[null,null,{"$error":"#VALUE!"},{"$error":"#VALUE!"},""]
[null,null,{"$error":"#VALUE!"},{"$error":"#VALUE!"},""]
[null,null,{"$error":"#VALUE!"},{"$error":"#VALUE!"},""]
[null,null,{"$error":"#VALUE!"},{"$error":"#VALUE!"},""]
[null,null,{"$error":"#VALUE!"},{"$error":"#VALUE!"},""]
[null,null,{"$error":"#VALUE!"},{"$error":"#VALUE!"},""]
[null,null,{"$error":"#VALUE!"},{"$error":"#VALUE!"},""]
[null,null,{"$error":"#VALUE!"},{"$error":"#VALUE!"},""]
[null,null,{"$error":"#VALUE!"},{"$error":"#VALUE!"},""]
[null,null,{"$error":"#VALUE!"},{"$error":"#VALUE!"},""]
[null,null,{"$error":"#VALUE!"},{"$error":"#VALUE!"},""]
[null,null,{"$error":"#VALUE!"},{"$error":"#VALUE!"},""]
[null,null,{"$error":"#VALUE!"},{"$error":"#VALUE!"},""]
[null,null,{"$error":"#VALUE!"},{"$error":"#VALUE!"},""]
[null,null,{"$error":"#VALUE!"},{"$error":"#VALUE!"},""]
[null,null,{"$error":"#VALUE!"},{"$error":"#VALUE!"},""]
[null,null,{"$error":"#VALUE!"},{"$error":"#VALUE!"},""]
[null,null,{"$error":"#VALUE!"},{"$error":"#VALUE!"},""]
[null,null,{"$error":"#VALUE!"},{"$error":"#VALUE!"},""]
[null,null,{"$error":"#VALUE!"},{"$error":"#VALUE!"},""]
[null,null,{"$error":"#VALUE!"},{"$error":"#VALUE!"},""]
[null,null,{"$error":"#VALUE!"},{"$error":"#VALUE!"},""]
[null,null,{"$error":"#VALUE!"},{"$error":"#VALUE!"},""]
[null,null,{"$error":"#VALUE!"},{"$error":"#VALUE!"},""]
[null,null,{"$error":"#VALUE!"},{"$error":"#VALUE!"},""]
[null,null,{"$error":"#VALUE!"},{"$error":"#VALUE!"},""]
[null,null,{"$error":"#VALUE!"},{"$error":"#VALUE!"},""]
[null,null,{"$error":"#VALUE!"},{"$error":"#VALUE!"},""]
[null,null,{"$error":"#VALUE!"},{"$error":"#VALUE!"},""]
[null,null,{"$error":"#VALUE!"},{"$error":"#VALUE!"},""]
[null,null,{"$error":"#VALUE!"},{"$error":"#VALUE!"},""]
[null,null,{"$error":"#VALUE!"},{"$error":"#VALUE!"},""]
[null,null,{"$error":"#VALUE!"},{"$error":"#VALUE!"},""]
[null,null,{"$error":"#VALUE!"},{"$error":"#VALUE!"},""]
[null,null,{"$error":"#VALUE!"},{"$error":"#VALUE!"},""]
[null,null,{"$error":"#VALUE!"},{"$error":"#VALUE!"},""]
[null,null,{"$error":"#VALUE!"},{"$error":"#VALUE!"},""]
[null,null,{"$error":"#VALUE!"},{"$error":"#VALUE!"},""]
[null,null,{"$error":"#VALUE!"},{"$error":"#VALUE!"},""]
[null,null,{"$error":"#VALUE!"},{"$error":"#VALUE!"},""]
[null,null,{"$error":"#VALUE!"},{"$error":"#VALUE!"},""]
[null,null,{"$f":"MID(A698,FIND(\"[\",A698)+1,999)","v":{"$error":"#VALUE!"}},{"$f":"MID(C698,1,FIND(\"]\",C698)-1)","v":{"$error":"#VALUE!"}},{"$f":"IFERROR(D698,\"\")","v":""}]
[null,null,{"$error":"#VALUE!"},{"$error":"#VALUE!"},""]
[null,null,{"$error":"#VALUE!"},{"$error":"#VALUE!"},""]
[null,null,{"$error":"#VALUE!"},{"$error":"#VALUE!"},""]
[null,null,{"$error":"#VALUE!"},{"$error":"#VALUE!"},""]
[null,null,{"$error":"#VALUE!"},{"$error":"#VALUE!"},""]
[null,null,{"$error":"#VALUE!"},{"$error":"#VALUE!"},""]
[null,null,{"$error":"#VALUE!"},{"$error":"#VALUE!"},""]
[null,null,{"$error":"#VALUE!"},{"$error":"#VALUE!"},""]
[null,null,{"$error":"#VALUE!"},{"$error":"#VALUE!"},""]
[null,null,{"$error":"#VALUE!"},{"$error":"#VALUE!"},""]
[null,null,{"$error":"#VALUE!"},{"$error":"#VALUE!"},""]
[null,null,{"$error":"#VALUE!"},{"$error":"#VALUE!"},""]
[null,null,{"$error":"#VALUE!"},{"$error":"#VALUE!"},""]
[null,null,{"$error":"#VALUE!"},{"$error":"#VALUE!"},""]
[null,null,{"$error":"#VALUE!"},{"$error":"#VALUE!"},""]
[null,null,{"$error":"#VALUE!"},{"$error":"#VALUE!"},""]
[null,null,{"$error":"#VALUE!"},{"$error":"#VALUE!"},""]
[null,null,{"$error":"#VALUE!"},{"$error":"#VALUE!"},""]
[null,null,{"$error":"#VALUE!"},{"$error":"#VALUE!"},""]
[null,null,{"$error":"#VALUE!"},{"$error":"#VALUE!"},""]
[null,null,{"$error":"#VALUE!"},{"$error":"#VALUE!"},""]
[null,null,{"$error":"#VALUE!"},{"$error":"#VALUE!"},""]
[null,null,{"$error":"#VALUE!"},{"$error":"#VALUE!"},""]
[null,null,{"$error":"#VALUE!"},{"$error":"#VALUE!"},""]
[null,null,{"$error":"#VALUE!"},{"$error":"#VALUE!"},""]
[null,null,{"$error":"#VALUE!"},{"$error":"#VALUE!"},""]
[null,null,{"$error":"#VALUE!"},{"$error":"#VALUE!"},""]
[null,null,{"$error":"#VALUE!"},{"$error":"#VALUE!"},""]
[null,null,{"$error":"#VALUE!"},{"$error":"#VALUE!"},""]
[null,null,{"$error":"#VALUE!"},{"$error":"#VALUE!"},""]
[null,null,{"$error":"#VALUE!"},{"$error":"#VALUE!"},""]
[null,null,{"$error":"#VALUE!"},{"$error":"#VALUE!"},""]
[null,null,{"$error":"#VALUE!"},{"$error":"#VALUE!"},""]
[null,null,{"$error":"#VALUE!"},{"$error":"#VALUE!"},""]
[null,null,{"$error":"#VALUE!"},{"$error":"#VALUE!"},""]
[null,null,{"$error":"#VALUE!"},{"$error":"#VALUE!"},""]
[null,null,{"$error":"#VALUE!"},{"$error":"#VALUE!"},""]
[null,null,{"$error":"#VALUE!"},{"$error":"#VALUE!"},""]
[null,null,{"$error":"#VALUE!"},{"$error":"#VALUE!"},""]
[null,null,{"$error":"#VALUE!"},{"$error":"#VALUE!"},""]
[null,null,{"$error":"#VALUE!"},{"$error":"#VALUE!"},""]
[null,null,{"$error":"#VALUE!"},{"$error":"#VALUE!"},""]
[null,null,{"$error":"#VALUE!"},{"$error":"#VALUE!"},""]
[null,null,{"$error":"#VALUE!"},{"$error":"#VALUE!"},""]
[null,null,{"$error":"#VALUE!"},{"$error":"#VALUE!"},""]
[null,null,{"$error":"#VALUE!"},{"$error":"#VALUE!"},""]
[null,null,{"$error":"#VALUE!"},{"$error":"#VALUE!"},""]
[null,null,{"$error":"#VALUE!"},{"$error":"#VALUE!"},""]
[null,null,{"$error":"#VALUE!"},{"$error":"#VALUE!"},""]
[null,null,{"$error":"#VALUE!"},{"$error":"#VALUE!"},""]
[null,null,{"$error":"#VALUE!"},{"$error":"#VALUE!"},""]
[null,null,{"$error":"#VALUE!"},{"$error":"#VALUE!"},""]
[null,null,{"$error":"#VALUE!"},{"$error":"#VALUE!"},""]
[null,null,{"$error":"#VALUE!"},{"$error":"#VALUE!"},""]
[null,null,{"$error":"#VALUE!"},{"$error":"#VALUE!"},""]
[null,null,{"$error":"#VALUE!"},{"$error":"#VALUE!"},""]
[null,null,{"$error":"#VALUE!"},{"$error":"#VALUE!"},""]
[null,null,{"$error":"#VALUE!"},{"$error":"#VALUE!"},""]
[null,null,{"$error":"#VALUE!"},{"$error":"#VALUE!"},""]
[null,null,{"$error":"#VALUE!"},{"$error":"#VALUE!"},""]
[null,null,{"$error":"#VALUE!"},{"$error":"#VALUE!"},""]
[null,null,{"$error":"#VALUE!"},{"$error":"#VALUE!"},""]
[null,null,{"$error":"#VALUE!"},{"$error":"#VALUE!"},""]
[null,null,{"$f":"MID(A762,FIND(\"[\",A762)+1,999)","v":{"$error":"#VALUE!"}},{"$f":"MID(C762,1,FIND(\"]\",C762)-1)","v":{"$error":"#VALUE!"}},{"$f":"IFERROR(D762,\"\")","v":""}]
[null,null,{"$error":"#VALUE!"},{"$error":"#VALUE!"},""]
[null,null,{"$error":"#VALUE!"},{"$error":"#VALUE!"},""]
[null,null,{"$error":"#VALUE!"},{"$error":"#VALUE!"},""]
[null,null,{"$error":"#VALUE!"},{"$error":"#VALUE!"},""]
[null,null,{"$error":"#VALUE!"},{"$error":"#VALUE!"},""]
[null,null,{"$error":"#VALUE!"},{"$error":"#VALUE!"},""]
[null,null,{"$error":"#VALUE!"},{"$error":"#VALUE!"},""]
[null,null,{"$error":"#VALUE!"},{"$error":"#VALUE!"},""]
[null,null,{"$error":"#VALUE!"},{"$error":"#VALUE!"},""]
[null,null,{"$error":"#VALUE!"},{"$error":"#VALUE!"},""]
[null,null,{"$error":"#VALUE!"},{"$error":"#VALUE!"},""]
[null,null,{"$error":"#VALUE!"},{"$error":"#VALUE!"},""]
[null,null,{"$error":"#VALUE!"},{"$error":"#VALUE!"},""]
[null,null,{"$error":"#VALUE!"},{"$error":"#VALUE!"},""]
[null,null,{"$error":"#VALUE!"},{"$error":"#VALUE!"},""]
[null,null,{"$error":"#VALUE!"},{"$error":"#VALUE!"},""]
[null,null,{"$error":"#VALUE!"},{"$error":"#VALUE!"},""]
[null,null,{"$error":"#VALUE!"},{"$error":"#VALUE!"},""]
[null,null,{"$error":"#VALUE!"},{"$error":"#VALUE!"},""]
[null,null,{"$error":"#VALUE!"},{"$error":"#VALUE!"},""]
[null,null,{"$error":"#VALUE!"},{"$error":"#VALUE!"},""]
[null,null,{"$error":"#VALUE!"},{"$error":"#VALUE!"},""]
[null,null,{"$error":"#VALUE!"},{"$error":"#VALUE!"},""]
[null,null,{"$error":"#VALUE!"},{"$error":"#VALUE!"},""]
[null,null,{"$error":"#VALUE!"},{"$error":"#VALUE!"},""]
[null,null,{"$error":"#VALUE!"},{"$error":"#VALUE!"},""]
[null,null,{"$error":"#VALUE!"},{"$error":"#VALUE!"},""]
[null,null,{"$error":"#VALUE!"},{"$error":"#VALUE!"},""]
[null,null,{"$error":"#VALUE!"},{"$error":"#VALUE!"},""]
[null,null,{"$error":"#VALUE!"},{"$error":"#VALUE!"},""]
[null,null,{"$error":"#VALUE!"},{"$error":"#VALUE!"},""]
[null,null,{"$error":"#VALUE!"},{"$error":"#VALUE!"},""]
[null,null,{"$error":"#VALUE!"},{"$error":"#VALUE!"},""]
[null,null,{"$error":"#VALUE!"},{"$error":"#VALUE!"},""]
[null,null,{"$error":"#VALUE!"},{"$error":"#VALUE!"},""]
[null,null,{"$error":"#VALUE!"},{"$error":"#VALUE!"},""]
[null,null,{"$error":"#VALUE!"},{"$error":"#VALUE!"},""]
[null,null,{"$error":"#VALUE!"},{"$error":"#VALUE!"},""]
[null,null,{"$error":"#VALUE!"},{"$error":"#VALUE!"},""]
[null,null,{"$error":"#VALUE!"},{"$error":"#VALUE!"},""]
[null,null,{"$error":"#VALUE!"},{"$error":"#VALUE!"},""]
[null,null,{"$error":"#VALUE!"},{"$error":"#VALUE!"},""]
[null,null,{"$error":"#VALUE!"},{"$error":"#VALUE!"},""]
[null,null,{"$error":"#VALUE!"},{"$error":"#VALUE!"},""]
[null,null,{"$error":"#VALUE!"},{"$error":"#VALUE!"},""]
[null,null,{"$error":"#VALUE!"},{"$error":"#VALUE!"},""]
[null,null,{"$error":"#VALUE!"},{"$error":"#VALUE!"},""]
[null,null,{"$error":"#VALUE!"},{"$error":"#VALUE!"},""]
[null,null,{"$error":"#VALUE!"},{"$error":"#VALUE!"},""]
[null,null,{"$error":"#VALUE!"},{"$error":"#VALUE!"},""]
[null,null,{"$error":"#VALUE!"},{"$error":"#VALUE!"},""]
[null,null,{"$error":"#VALUE!"},{"$error":"#VALUE!"},""]
[null,null,{"$error":"#VALUE!"},{"$error":"#VALUE!"},""]
[null,null,{"$error":"#VALUE!"},{"$error":"#VALUE!"},""]
[null,null,{"$error":"#VALUE!"},{"$error":"#VALUE!"},""]
[null,null,{"$error":"#VALUE!"},{"$error":"#VALUE!"},""]
[null,null,{"$error":"#VALUE!"},{"$error":"#VALUE!"},""]
[null,null,{"$error":"#VALUE!"},{"$error":"#VALUE!"},""]
[null,null,{"$error":"#VALUE!"},{"$error":"#VALUE!"},""]
[null,null,{"$error":"#VALUE!"},{"$error":"#VALUE!"},""]
[null,null,{"$error":"#VALUE!"},{"$error":"#VALUE!"},""]
[null,null,{"$error":"#VALUE!"},{"$error":"#VALUE!"},""]
[null,null,{"$error":"#VALUE!"},{"$error":"#VALUE!"},""]
[null,null,{"$f":"MID(A826,FIND(\"[\",A826)+1,999)","v":{"$error":"#VALUE!"}},{"$f":"MID(C826,1,FIND(\"]\",C826)-1)","v":{"$error":"#VALUE!"}},{"$f":"IFERROR(D826,\"\")","v":""}]
[null,null,{"$error":"#VALUE!"},{"$error":"#VALUE!"},""]
[null,null,{"$error":"#VALUE!"},{"$error":"#VALUE!"},""]
[null,null,{"$error":"#VALUE!"},{"$error":"#VALUE!"},""]
[null,null,{"$error":"#VALUE!"},{"$error":"#VALUE!"},""]
[null,null,{"$error":"#VALUE!"},{"$error":"#VALUE!"},""]
[null,null,{"$error":"#VALUE!"},{"$error":"#VALUE!"},""]
[null,null,{"$error":"#VALUE!"},{"$error":"#VALUE!"},""]
[null,null,{"$error":"#VALUE!"},{"$error":"#VALUE!"},""]
[null,null,{"$error":"#VALUE!"},{"$error":"#VALUE!"},""]
[null,null,{"$error":"#VALUE!"},{"$error":"#VALUE!"},""]
[null,null,{"$error":"#VALUE!"},{"$error":"#VALUE!"},""]
[null,null,{"$error":"#VALUE!"},{"$error":"#VALUE!"},""]
[null,null,{"$error":"#VALUE!"},{"$error":"#VALUE!"},""]
[null,null,{"$error":"#VALUE!"},{"$error":"#VALUE!"},""]
[null,null,{"$error":"#VALUE!"},{"$error":"#VALUE!"},""]
[null,null,{"$error":"#VALUE!"},{"$error":"#VALUE!"},""]
[null,null,{"$error":"#VALUE!"},{"$error":"#VALUE!"},""]
[null,null,{"$error":"#VALUE!"},{"$error":"#VALUE!"},""]
[null,null,{"$error":"#VALUE!"},{"$error":"#VALUE!"},""]
[null,null,{"$error":"#VALUE!"},{"$error":"#VALUE!"},""]
[null,null,{"$error":"#VALUE!"},{"$error":"#VALUE!"},""]
[null,null,{"$error":"#VALUE!"},{"$error":"#VALUE!"},""]
[null,null,{"$error":"#VALUE!"},{"$error":"#VALUE!"},""]
[null,null,{"$error":"#VALUE!"},{"$error":"#VALUE!"},""]
[null,null,{"$error":"#VALUE!"},{"$error":"#VALUE!"},""]
[null,null,{"$error":"#VALUE!"},{"$error":"#VALUE!"},""]
[null,null,{"$error":"#VALUE!"},{"$error":"#VALUE!"},""]
[null,null,{"$error":"#VALUE!"},{"$error":"#VALUE!"},""]
[null,null,{"$error":"#VALUE!"},{"$error":"#VALUE!"},""]
[null,null,{"$error":"#VALUE!"},{"$error":"#VALUE!"},""]
[null,null,{"$error":"#VALUE!"},{"$error":"#VALUE!"},""]
[null,null,{"$error":"#VALUE!"},{"$error":"#VALUE!"},""]
[null,null,{"$error":"#VALUE!"},{"$error":"#VALUE!"},""]
[null,null,{"$error":"#VALUE!"},{"$error":"#VALUE!"},""]
[null,null,{"$error":"#VALUE!"},{"$error":"#VALUE!"},""]
[null,null,{"$error":"#VALUE!"},{"$error":"#VALUE!"},""]
[null,null,{"$error":"#VALUE!"},{"$error":"#VALUE!"},""]
[null,null,{"$error":"#VALUE!"},{"$error":"#VALUE!"},""]
[null,null,{"$error":"#VALUE!"},{"$error":"#VALUE!"},""]
[null,null,{"$error":"#VALUE!"},{"$error":"#VALUE!"},""]
[null,null,{"$error":"#VALUE!"},{"$error":"#VALUE!"},""]
[null,null,{"$error":"#VALUE!"},{"$error":"#VALUE!"},""]
[null,null,{"$error":"#VALUE!"},{"$error":"#VALUE!"},""]
[null,null,{"$error":"#VALUE!"},{"$error":"#VALUE!"},""]
[null,null,{"$error":"#VALUE!"},{"$error":"#VALUE!"},""]
[null,null,{"$error":"#VALUE!"},{"$error":"#VALUE!"},""]
[null,null,{"$error":"#VALUE!"},{"$error":"#VALUE!"},""]
[null,null,{"$error":"#VALUE!"},{"$error":"#VALUE!"},""]
[null,null,{"$error":"#VALUE!"},{"$error":"#VALUE!"},""]
[null,null,{"$error":"#VALUE!"},{"$error":"#VALUE!"},""]
[null,null,{"$error":"#VALUE!"},{"$error":"#VALUE!"},""]
[null,null,{"$error":"#VALUE!"},{"$error":"#VALUE!"},""]
[null,null,{"$error":"#VALUE!"},{"$error":"#VALUE!"},""]
[null,null,{"$error":"#VALUE!"},{"$error":"#VALUE!"},""]
[null,null,{"$error":"#VALUE!"},{"$error":"#VALUE!"},""]
[null,null,{"$error":"#VALUE!"},{"$error":"#VALUE!"},""]
[null,null,{"$error":"#VALUE!"},{"$error":"#VALUE!"},""]
[null,null,{"$error":"#VALUE!"},{"$error":"#VALUE!"},""]
[null,null,{"$error":"#VALUE!"},{"$error":"#VALUE!"},""]
[null,null,{"$error":"#VALUE!"},{"$error":"#VALUE!"},""]
[null,null,{"$error":"#VALUE!"},{"$error":"#VALUE!"},""]
[null,null,{"$error":"#VALUE!"},{"$error":"#VALUE!"},""]
[null,null,{"$error":"#VALUE!"},{"$error":"#VALUE!"},""]
[null,null,{"$f":"MID(A890,FIND(\"[\",A890)+1,999)","v":{"$error":"#VALUE!"}},{"$f":"MID(C890,1,FIND(\"]\",C890)-1)","v":{"$error":"#VALUE!"}},{"$f":"IFERROR(D890,\"\")","v":""}]
[null,null,{"$error":"#VALUE!"},{"$error":"#VALUE!"},""]
[null,null,{"$error":"#VALUE!"},{"$error":"#VALUE!"},""]
[null,null,{"$error":"#VALUE!"},{"$error":"#VALUE!"},""]
[null,null,{"$error":"#VALUE!"},{"$error":"#VALUE!"},""]
[null,null,{"$error":"#VALUE!"},{"$error":"#VALUE!"},""]
[null,null,{"$error":"#VALUE!"},{"$error":"#VALUE!"},""]
[null,null,{"$error":"#VALUE!"},{"$error":"#VALUE!"},""]
[null,null,{"$error":"#VALUE!"},{"$error":"#VALUE!"},""]
[null,null,{"$error":"#VALUE!"},{"$error":"#VALUE!"},""]
[null,null,{"$error":"#VALUE!"},{"$error":"#VALUE!"},""]
[null,null,{"$error":"#VALUE!"},{"$error":"#VALUE!"},""]
[null,null,{"$error":"#VALUE!"},{"$error":"#VALUE!"},""]
[null,null,{"$error":"#VALUE!"},{"$error":"#VALUE!"},""]
[null,null,{"$error":"#VALUE!"},{"$error":"#VALUE!"},""]
[null,null,{"$error":"#VALUE!"},{"$error":"#VALUE!"},""]
[null,null,{"$error":"#VALUE!"},{"$error":"#VALUE!"},""]
[null,null,{"$error":"#VALUE!"},{"$error":"#VALUE!"},""]
[null,null,{"$error":"#VALUE!"},{"$error":"#VALUE!"},""]
[null,null,{"$error":"#VALUE!"},{"$error":"#VALUE!"},""]
[null,null,{"$error":"#VALUE!"},{"$error":"#VALUE!"},""]
[null,null,{"$error":"#VALUE!"},{"$error":"#VALUE!"},""]
[null,null,{"$error":"#VALUE!"},{"$error":"#VALUE!"},""]
[null,null,{"$error":"#VALUE!"},{"$error":"#VALUE!"},""]
[null,null,{"$error":"#VALUE!"},{"$error":"#VALUE!"},""]
[null,null,{"$error":"#VALUE!"},{"$error":"#VALUE!"},""]
[null,null,{"$error":"#VALUE!"},{"$error":"#VALUE!"},""]
[null,null,{"$error":"#VALUE!"},{"$error":"#VALUE!"},""]
[null,null,{"$error":"#VALUE!"},{"$error":"#VALUE!"},""]
[null,null,{"$error":"#VALUE!"},{"$error":"#VALUE!"},""]
[null,null,{"$error":"#VALUE!"},{"$error":"#VALUE!"},""]
[null,null,{"$error":"#VALUE!"},{"$error":"#VALUE!"},""]
[null,null,{"$error":"#VALUE!"},{"$error":"#VALUE!"},""]
[null,null,{"$error":"#VALUE!"},{"$error":"#VALUE!"},""]
[null,null,{"$error":"#VALUE!"},{"$error":"#VALUE!"},""]
[null,null,{"$error":"#VALUE!"},{"$error":"#VALUE!"},""]
[null,null,{"$error":"#VALUE!"},{"$error":"#VALUE!"},""]
[null,null,{"$error":"#VALUE!"},{"$error":"#VALUE!"},""]
[null,null,{"$error":"#VALUE!"},{"$error":"#VALUE!"},""]
[null,null,{"$error":"#VALUE!"},{"$error":"#VALUE!"},""]
[null,null,{"$error":"#VALUE!"},{"$error":"#VALUE!"},""]
[null,null,{"$error":"#VALUE!"},{"$error":"#VALUE!"},""]
[null,null,{"$error":"#VALUE!"},{"$error":"#VALUE!"},""]
[null,null,{"$error":"#VALUE!"},{"$error":"#VALUE!"},""]
[null,null,{"$error":"#VALUE!"},{"$error":"#VALUE!"},""]
[null,null,{"$error":"#VALUE!"},{"$error":"#VALUE!"},""]
[null,null,{"$error":"#VALUE!"},{"$error":"#VALUE!"},""]
[null,null,{"$error":"#VALUE!"},{"$error":"#VALUE!"},""]
[null,null,{"$error":"#VALUE!"},{"$error":"#VALUE!"},""]
[null,null,{"$error":"#VALUE!"},{"$error":"#VALUE!"},""]
[null,null,{"$error":"#VALUE!"},{"$error":"#VALUE!"},""]
[null,null,{"$error":"#VALUE!"},{"$error":"#VALUE!"},""]
[null,null,{"$error":"#VALUE!"},{"$error":"#VALUE!"},""]
[null,null,{"$error":"#VALUE!"},{"$error":"#VALUE!"},""]
[null,null,{"$error":"#VALUE!"},{"$error":"#VALUE!"},""]
[null,null,{"$error":"#VALUE!"},{"$error":"#VALUE!"},""]
[null,null,{"$error":"#VALUE!"},{"$error":"#VALUE!"},""]
[null,null,{"$error":"#VALUE!"},{"$error":"#VALUE!"},""]
[null,null,{"$error":"#VALUE!"},{"$error":"#VALUE!"},""]
[null,null,{"$error":"#VALUE!"},{"$error":"#VALUE!"},""]
[null,null,{"$error":"#VALUE!"},{"$error":"#VALUE!"},""]
[null,null,{"$error":"#VALUE!"},{"$error":"#VALUE!"},""]
[null,null,{"$error":"#VALUE!"},{"$error":"#VALUE!"},""]
[null,null,{"$error":"#VALUE!"},{"$error":"#VALUE!"},""]
[null,null,{"$f":"MID(A954,FIND(\"[\",A954)+1,999)","v":{"$error":"#VALUE!"}},{"$f":"MID(C954,1,FIND(\"]\",C954)-1)","v":{"$error":"#VALUE!"}},{"$f":"IFERROR(D954,\"\")","v":""}]
[null,null,{"$error":"#VALUE!"},{"$error":"#VALUE!"},""]
[null,null,{"$error":"#VALUE!"},{"$error":"#VALUE!"},""]
[null,null,{"$error":"#VALUE!"},{"$error":"#VALUE!"},""]
[null,null,{"$error":"#VALUE!"},{"$error":"#VALUE!"},""]
[null,null,{"$error":"#VALUE!"},{"$error":"#VALUE!"},""]
[null,null,{"$error":"#VALUE!"},{"$error":"#VALUE!"},""]
[null,null,{"$error":"#VALUE!"},{"$error":"#VALUE!"},""]
[null,null,{"$error":"#VALUE!"},{"$error":"#VALUE!"},""]
[null,null,{"$error":"#VALUE!"},{"$error":"#VALUE!"},""]
[null,null,{"$error":"#VALUE!"},{"$error":"#VALUE!"},""]
[null,null,{"$error":"#VALUE!"},{"$error":"#VALUE!"},""]
[null,null,{"$error":"#VALUE!"},{"$error":"#VALUE!"},""]
[null,null,{"$error":"#VALUE!"},{"$error":"#VALUE!"},""]
[null,null,{"$error":"#VALUE!"},{"$error":"#VALUE!"},""]
[null,null,{"$error":"#VALUE!"},{"$error":"#VALUE!"},""]
[null,null,{"$error":"#VALUE!"},{"$error":"#VALUE!"},""]
[null,null,{"$error":"#VALUE!"},{"$error":"#VALUE!"},""]
[null,null,{"$error":"#VALUE!"},{"$error":"#VALUE!"},""]
[null,null,{"$error":"#VALUE!"},{"$error":"#VALUE!"},""]
[null,null,{"$error":"#VALUE!"},{"$error":"#VALUE!"},""]
[null,null,{"$error":"#VALUE!"},{"$error":"#VALUE!"},""]
[null,null,{"$error":"#VALUE!"},{"$error":"#VALUE!"},""]
[null,null,{"$error":"#VALUE!"},{"$error":"#VALUE!"},""]
[null,null,{"$error":"#VALUE!"},{"$error":"#VALUE!"},""]
[null,null,{"$error":"#VALUE!"},{"$error":"#VALUE!"},""]
[null,null,{"$error":"#VALUE!"},{"$error":"#VALUE!"},""]
[null,null,{"$error":"#VALUE!"},{"$error":"#VALUE!"},""]
[null,null,{"$error":"#VALUE!"},{"$error":"#VALUE!"},""]
[null,null,{"$error":"#VALUE!"},{"$error":"#VALUE!"},""]
[null,null,{"$error":"#VALUE!"},{"$error":"#VALUE!"},""]
[null,null,{"$error":"#VALUE!"},{"$error":"#VALUE!"},""]
[null,null,{"$error":"#VALUE!"},{"$error":"#VALUE!"},""]
[null,null,{"$error":"#VALUE!"},{"$error":"#VALUE!"},""]
[null,null,{"$error":"#VALUE!"},{"$error":"#VALUE!"},""]
[null,null,{"$error":"#VALUE!"},{"$error":"#VALUE!"},""]
[null,null,{"$error":"#VALUE!"},{"$error":"#VALUE!"},""]
[null,null,{"$error":"#VALUE!"},{"$error":"#VALUE!"},""]
[null,null,{"$error":"#VALUE!"},{"$error":"#VALUE!"},""]
[null,null,{"$error":"#VALUE!"},{"$error":"#VALUE!"},""]
[null,null,{"$error":"#VALUE!"},{"$error":"#VALUE!"},""]
[null,null,{"$error":"#VALUE!"},{"$error":"#VALUE!"},""]
[null,null,{"$error":"#VALUE!"},{"$error":"#VALUE!"},""]
[null,null,{"$error":"#VALUE!"},{"$error":"#VALUE!"},""]
[null,null,{"$error":"#VALUE!"},{"$error":"#VALUE!"},""]
[null,null,{"$error":"#VALUE!"},{"$error":"#VALUE!"},""]
[null,null,{"$error":"#VALUE!"},{"$error":"#VALUE!"},""]
[null,null,{"$f":"MID(A1001,FIND(\"[\",A1001)+1,999)","v":{"$error":"#VALUE!"}},{"$f":"MID(C1001,1,FIND(\"]\",C1001)-1)","v":{"$error":"#VALUE!"}},{"$f":"IFERROR(D1001,\"\")","v":""}]
[null,null,{"$error":"#VALUE!"},{"$error":"#VALUE!"},""]
[null,null,{"$error":"#VALUE!"},{"$error":"#VALUE!"},""]
[null,null,{"$error":"#VALUE!"},{"$error":"#VALUE!"},""]
[null,null,{"$error":"#VALUE!"},{"$error":"#VALUE!"},""]
[null,null,{"$error":"#VALUE!"},{"$error":"#VALUE!"},""]
[null,null,{"$error":"#VALUE!"},{"$error":"#VALUE!"},""]
[null,null,{"$error":"#VALUE!"},{"$error":"#VALUE!"},""]
[null,null,{"$error":"#VALUE!"},{"$error":"#VALUE!"},""]
[null,null,{"$error":"#VALUE!"},{"$error":"#VALUE!"},""]
[null,null,{"$error":"#VALUE!"},{"$error":"#VALUE!"},""]
[null,null,{"$error":"#VALUE!"},{"$error":"#VALUE!"},""]
[null,null,{"$error":"#VALUE!"},{"$error":"#VALUE!"},""]
[null,null,{"$error":"#VALUE!"},{"$error":"#VALUE!"},""]
[null,null,{"$error":"#VALUE!"},{"$error":"#VALUE!"},""]
[null,null,{"$error":"#VALUE!"},{"$error":"#VALUE!"},""]
[null,null,{"$error":"#VALUE!"},{"$error":"#VALUE!"},""]
[null,null,{"$error":"#VALUE!"},{"$error":"#VALUE!"},""]
[null,null,{"$error":"#VALUE!"},{"$error":"#VALUE!"},""]
[null,null,{"$error":"#VALUE!"},{"$error":"#VALUE!"},""]
[null,null,{"$error":"#VALUE!"},{"$error":"#VALUE!"},""]
[null,null,{"$error":"#VALUE!"},{"$error":"#VALUE!"},""]
[null,null,{"$error":"#VALUE!"},{"$error":"#VALUE!"},""]
[null,null,{"$error":"#VALUE!"},{"$error":"#VALUE!"},""]
[null,null,{"$error":"#VALUE!"},{"$error":"#VALUE!"},""]
[null,null,{"$error":"#VALUE!"},{"$error":"#VALUE!"},""]
[null,null,{"$error":"#VALUE!"},{"$error":"#VALUE!"},""]
[null,null,{"$error":"#VALUE!"},{"$error":"#VALUE!"},""]
[null,null,{"$error":"#VALUE!"},{"$error":"#VALUE!"},""]
[null,null,{"$error":"#VALUE!"},{"$error":"#VALUE!"},""]
[null,null,{"$error":"#VALUE!"},{"$error":"#VALUE!"},""]
[null,null,{"$error":"#VALUE!"},{"$error":"#VALUE!"},""]
[null,null,{"$error":"#VALUE!"},{"$error":"#VALUE!"},""]
[null,null,{"$error":"#VALUE!"},{"$error":"#VALUE!"},""]
[null,null,{"$error":"#VALUE!"},{"$error":"#VALUE!"},""]
[null,null,{"$error":"#VALUE!"},{"$error":"#VALUE!"},""]
[null,null,{"$error":"#VALUE!"},{"$error":"#VALUE!"},""]
[null,null,{"$error":"#VALUE!"},{"$error":"#VALUE!"},""]
[null,null,{"$error":"#VALUE!"},{"$error":"#VALUE!"},""]
[null,null,{"$error":"#VALUE!"},{"$error":"#VALUE!"},""]
[null,null,{"$error":"#VALUE!"},{"$error":"#VALUE!"},""]
[null,null,{"$error":"#VALUE!"},{"$error":"#VALUE!"},""]
[null,null,{"$error":"#VALUE!"},{"$error":"#VALUE!"},""]
[null,null,{"$error":"#VALUE!"},{"$error":"#VALUE!"},""]
[null,null,{"$error":"#VALUE!"},{"$error":"#VALUE!"},""]
[null,null,{"$error":"#VALUE!"},{"$error":"#VALUE!"},""]
[null,null,{"$error":"#VALUE!"},{"$error":"#VALUE!"},""]
[null,null,{"$error":"#VALUE!"},{"$error":"#VALUE!"},""]
[null,null,{"$error":"#VALUE!"},{"$error":"#VALUE!"},""]
[null,null,{"$error":"#VALUE!"},{"$error":"#VALUE!"},""]
[null,null,{"$error":"#VALUE!"},{"$error":"#VALUE!"},""]
[null,null,{"$error":"#VALUE!"},{"$error":"#VALUE!"},""]
[null,null,{"$error":"#VALUE!"},{"$error":"#VALUE!"},""]
[null,null,{"$error":"#VALUE!"},{"$error":"#VALUE!"},""]
[null,null,{"$error":"#VALUE!"},{"$error":"#VALUE!"},""]
[null,null,{"$error":"#VALUE!"},{"$error":"#VALUE!"},""]
[null,null,{"$error":"#VALUE!"},{"$error":"#VALUE!"},""]
[null,null,{"$error":"#VALUE!"},{"$error":"#VALUE!"},""]
[null,null,{"$error":"#VALUE!"},{"$error":"#VALUE!"},""]
[null,null,{"$error":"#VALUE!"},{"$error":"#VALUE!"},""]
[null,null,{"$error":"#VALUE!"},{"$error":"#VALUE!"},""]
[null,null,{"$error":"#VALUE!"},{"$error":"#VALUE!"},""]
[null,null,{"$error":"#VALUE!"},{"$error":"#VALUE!"},""]
[null,null,{"$error":"#VALUE!"},{"$error":"#VALUE!"},""]
[null,null,{"$f":"MID(A1065,FIND(\"[\",A1065)+1,999)","v":{"$error":"#VALUE!"}},{"$f":"MID(C1065,1,FIND(\"]\",C1065)-1)","v":{"$error":"#VALUE!"}},{"$f":"IFERROR(D1065,\"\")","v":""}]
[null,null,{"$error":"#VALUE!"},{"$error":"#VALUE!"},""]
[null,null,{"$error":"#VALUE!"},{"$error":"#VALUE!"},""]
[null,null,{"$error":"#VALUE!"},{"$error":"#VALUE!"},""]
[null,null,{"$error":"#VALUE!"},{"$error":"#VALUE!"},""]
[null,null,{"$error":"#VALUE!"},{"$error":"#VALUE!"},""]
[null,null,{"$error":"#VALUE!"},{"$error":"#VALUE!"},""]
[null,null,{"$error":"#VALUE!"},{"$error":"#VALUE!"},""]
[null,null,{"$error":"#VALUE!"},{"$error":"#VALUE!"},""]
[null,null,{"$error":"#VALUE!"},{"$error":"#VALUE!"},""]
[null,null,{"$error":"#VALUE!"},{"$error":"#VALUE!"},""]
[null,null,{"$error":"#VALUE!"},{"$error":"#VALUE!"},""]
[null,null,{"$error":"#VALUE!"},{"$error":"#VALUE!"},""]
[null,null,{"$error":"#VALUE!"},{"$error":"#VALUE!"},""]
[null,null,{"$error":"#VALUE!"},{"$error":"#VALUE!"},""]
[null,null,{"$error":"#VALUE!"},{"$error":"#VALUE!"},""]
[null,null,{"$error":"#VALUE!"},{"$error":"#VALUE!"},""]
[null,null,{"$error":"#VALUE!"},{"$error":"#VALUE!"},""]
[null,null,{"$error":"#VALUE!"},{"$error":"#VALUE!"},""]
[null,null,{"$error":"#VALUE!"},{"$error":"#VALUE!"},""]
[null,null,{"$error":"#VALUE!"},{"$error":"#VALUE!"},""]
[null,null,{"$error":"#VALUE!"},{"$error":"#VALUE!"},""]
[null,null,{"$error":"#VALUE!"},{"$error":"#VALUE!"},""]
[null,null,{"$error":"#VALUE!"},{"$error":"#VALUE!"},""]
[null,null,{"$error":"#VALUE!"},{"$error":"#VALUE!"},""]
[null,null,{"$error":"#VALUE!"},{"$error":"#VALUE!"},""]
[null,null,{"$error":"#VALUE!"},{"$error":"#VALUE!"},""]
[null,null,{"$error":"#VALUE!"},{"$error":"#VALUE!"},""]
[null,null,{"$error":"#VALUE!"},{"$error":"#VALUE!"},""]
[null,null,{"$error":"#VALUE!"},{"$error":"#VALUE!"},""]
[null,null,{"$error":"#VALUE!"},{"$error":"#VALUE!"},""]
[null,null,{"$error":"#VALUE!"},{"$error":"#VALUE!"},""]
[null,null,{"$error":"#VALUE!"},{"$error":"#VALUE!"},""]
[null,null,{"$error":"#VALUE!"},{"$error":"#VALUE!"},""]
[null,null,{"$error":"#VALUE!"},{"$error":"#VALUE!"},""]
[null,null,{"$error":"#VALUE!"},{"$error":"#VALUE!"},""]
[null,null,{"$error":"#VALUE!"},{"$error":"#VALUE!"},""]
[null,null,{"$error":"#VALUE!"},{"$error":"#VALUE!"},""]
[null,null,{"$error":"#VALUE!"},{"$error":"#VALUE!"},""]
[null,null,{"$error":"#VALUE!"},{"$error":"#VALUE!"},""]
[null,null,{"$error":"#VALUE!"},{"$error":"#VALUE!"},""]
[null,null,{"$error":"#VALUE!"},{"$error":"#VALUE!"},""]
[null,null,{"$error":"#VALUE!"},{"$error":"#VALUE!"},""]
[null,null,{"$error":"#VALUE!"},{"$error":"#VALUE!"},""]
[null,null,{"$error":"#VALUE!"},{"$error":"#VALUE!"},""]
[null,null,{"$error":"#VALUE!"},{"$error":"#VALUE!"},""]
[null,null,{"$error":"#VALUE!"},{"$error":"#VALUE!"},""]
[null,null,{"$error":"#VALUE!"},{"$error":"#VALUE!"},""]
[null,null,{"$error":"#VALUE!"},{"$error":"#VALUE!"},""]
[null,null,{"$error":"#VALUE!"},{"$error":"#VALUE!"},""]
[null,null,{"$error":"#VALUE!"},{"$error":"#VALUE!"},""]
[null,null,{"$error":"#VALUE!"},{"$error":"#VALUE!"},""]
[null,null,{"$error":"#VALUE!"},{"$error":"#VALUE!"},""]
[null,null,{"$error":"#VALUE!"},{"$error":"#VALUE!"},""]
[null,null,{"$error":"#VALUE!"},{"$error":"#VALUE!"},""]
[null,null,{"$error":"#VALUE!"},{"$error":"#VALUE!"},""]
[null,null,{"$error":"#VALUE!"},{"$error":"#VALUE!"},""]
[null,null,{"$error":"#VALUE!"},{"$error":"#VALUE!"},""]
[null,null,{"$error":"#VALUE!"},{"$error":"#VALUE!"},""]
[null,null,{"$error":"#VALUE!"},{"$error":"#VALUE!"},""]
[null,null,{"$error":"#VALUE!"},{"$error":"#VALUE!"},""]
[null,null,{"$error":"#VALUE!"},{"$error":"#VALUE!"},""]
[null,null,{"$error":"#VALUE!"},{"$error":"#VALUE!"},""]
[null,null,{"$error":"#VALUE!"},{"$error":"#VALUE!"},""]
[null,null,{"$f":"MID(A1129,FIND(\"[\",A1129)+1,999)","v":{"$error":"#VALUE!"}},{"$f":"MID(C1129,1,FIND(\"]\",C1129)-1)","v":{"$error":"#VALUE!"}},{"$f":"IFERROR(D1129,\"\")","v":""}]
[null,null,{"$error":"#VALUE!"},{"$error":"#VALUE!"},""]
[null,null,{"$error":"#VALUE!"},{"$error":"#VALUE!"},""]
[null,null,{"$error":"#VALUE!"},{"$error":"#VALUE!"},""]
[null,null,{"$error":"#VALUE!"},{"$error":"#VALUE!"},""]
[null,null,{"$error":"#VALUE!"},{"$error":"#VALUE!"},""]
[null,null,{"$error":"#VALUE!"},{"$error":"#VALUE!"},""]
[null,null,{"$error":"#VALUE!"},{"$error":"#VALUE!"},""]
[null,null,{"$error":"#VALUE!"},{"$error":"#VALUE!"},""]
[null,null,{"$error":"#VALUE!"},{"$error":"#VALUE!"},""]
[null,null,{"$error":"#VALUE!"},{"$error":"#VALUE!"},""]
[null,null,{"$error":"#VALUE!"},{"$error":"#VALUE!"},""]
[null,null,{"$error":"#VALUE!"},{"$error":"#VALUE!"},""]
[null,null,{"$error":"#VALUE!"},{"$error":"#VALUE!"},""]
[null,null,{"$error":"#VALUE!"},{"$error":"#VALUE!"},""]
[null,null,{"$error":"#VALUE!"},{"$error":"#VALUE!"},""]
[null,null,{"$error":"#VALUE!"},{"$error":"#VALUE!"},""]
[null,null,{"$error":"#VALUE!"},{"$error":"#VALUE!"},""]
[null,null,{"$error":"#VALUE!"},{"$error":"#VALUE!"},""]
[null,null,{"$error":"#VALUE!"},{"$error":"#VALUE!"},""]
[null,null,{"$error":"#VALUE!"},{"$error":"#VALUE!"},""]
[null,null,{"$error":"#VALUE!"},{"$error":"#VALUE!"},""]
[null,null,{"$error":"#VALUE!"},{"$error":"#VALUE!"},""]
[null,null,{"$error":"#VALUE!"},{"$error":"#VALUE!"},""]
[null,null,{"$error":"#VALUE!"},{"$error":"#VALUE!"},""]
[null,null,{"$error":"#VALUE!"},{"$error":"#VALUE!"},""]
[null,null,{"$error":"#VALUE!"},{"$error":"#VALUE!"},""]
[null,null,{"$error":"#VALUE!"},{"$error":"#VALUE!"},""]
[null,null,{"$error":"#VALUE!"},{"$error":"#VALUE!"},""]
[null,null,{"$error":"#VALUE!"},{"$error":"#VALUE!"},""]
[null,null,{"$error":"#VALUE!"},{"$error":"#VALUE!"},""]
[null,null,{"$error":"#VALUE!"},{"$error":"#VALUE!"},""]
[null,null,{"$error":"#VALUE!"},{"$error":"#VALUE!"},""]
[null,null,{"$error":"#VALUE!"},{"$error":"#VALUE!"},""]
[null,null,{"$error":"#VALUE!"},{"$error":"#VALUE!"},""]
[null,null,{"$error":"#VALUE!"},{"$error":"#VALUE!"},""]
[null,null,{"$error":"#VALUE!"},{"$error":"#VALUE!"},""]
[null,null,{"$error":"#VALUE!"},{"$error":"#VALUE!"},""]
[null,null,{"$error":"#VALUE!"},{"$error":"#VALUE!"},""]
[null,null,{"$error":"#VALUE!"},{"$error":"#VALUE!"},""]
[null,null,{"$error":"#VALUE!"},{"$error":"#VALUE!"},""]
[null,null,{"$error":"#VALUE!"},{"$error":"#VALUE!"},""]
[null,null,{"$error":"#VALUE!"},{"$error":"#VALUE!"},""]
[null,null,{"$error":"#VALUE!"},{"$error":"#VALUE!"},""]
[null,null,{"$error":"#VALUE!"},{"$error":"#VALUE!"},""]
[null,null,{"$error":"#VALUE!"},{"$error":"#VALUE!"},""]
[null,null,{"$error":"#VALUE!"},{"$error":"#VALUE!"},""]
[null,null,{"$error":"#VALUE!"},{"$error":"#VALUE!"},""]
[null,null,{"$error":"#VALUE!"},{"$error":"#VALUE!"},""]
[null,null,{"$error":"#VALUE!"},{"$error":"#VALUE!"},""]
[null,null,{"$error":"#VALUE!"},{"$error":"#VALUE!"},""]
[null,null,{"$error":"#VALUE!"},{"$error":"#VALUE!"},""]
[null,null,{"$error":"#VALUE!"},{"$error":"#VALUE!"},""]
[null,null,{"$error":"#VALUE!"},{"$error":"#VALUE!"},""]
[null,null,{"$error":"#VALUE!"},{"$error":"#VALUE!"},""]
[null,null,{"$error":"#VALUE!"},{"$error":"#VALUE!"},""]
[null,null,{"$error":"#VALUE!"},{"$error":"#VALUE!"},""]
[null,null,{"$error":"#VALUE!"},{"$error":"#VALUE!"},""]
[null,null,{"$error":"#VALUE!"},{"$error":"#VALUE!"},""]
[null,null,{"$error":"#VALUE!"},{"$error":"#VALUE!"},""]
[null,null,{"$error":"#VALUE!"},{"$error":"#VALUE!"},""]
[null,null,{"$error":"#VALUE!"},{"$error":"#VALUE!"},""]
[null,null,{"$error":"#VALUE!"},{"$error":"#VALUE!"},""]
[null,null,{"$error":"#VALUE!"},{"$error":"#VALUE!"},""]
[null,null,{"$f":"MID(A1193,FIND(\"[\",A1193)+1,999)","v":{"$error":"#VALUE!"}},{"$f":"MID(C1193,1,FIND(\"]\",C1193)-1)","v":{"$error":"#VALUE!"}},{"$f":"IFERROR(D1193,\"\")","v":""}]
[null,null,{"$error":"#VALUE!"},{"$error":"#VALUE!"},""]
[null,null,{"$error":"#VALUE!"},{"$error":"#VALUE!"},""]
[null,null,{"$error":"#VALUE!"},{"$error":"#VALUE!"},""]
[null,null,{"$error":"#VALUE!"},{"$error":"#VALUE!"},""]
[null,null,{"$error":"#VALUE!"},{"$error":"#VALUE!"},""]
[null,null,{"$error":"#VALUE!"},{"$error":"#VALUE!"},""]
[null,null,{"$error":"#VALUE!"},{"$error":"#VALUE!"},""]
[null,null,{"$error":"#VALUE!"},{"$error":"#VALUE!"},""]
[null,null,{"$error":"#VALUE!"},{"$error":"#VALUE!"},""]
[null,null,{"$error":"#VALUE!"},{"$error":"#VALUE!"},""]
[null,null,{"$error":"#VALUE!"},{"$error":"#VALUE!"},""]
[null,null,{"$error":"#VALUE!"},{"$error":"#VALUE!"},""]
[null,null,{"$error":"#VALUE!"},{"$error":"#VALUE!"},""]
[null,null,{"$error":"#VALUE!"},{"$error":"#VALUE!"},""]
[null,null,{"$error":"#VALUE!"},{"$error":"#VALUE!"},""]
[null,null,{"$error":"#VALUE!"},{"$error":"#VALUE!"},""]
[null,null,{"$error":"#VALUE!"},{"$error":"#VALUE!"},""]
[null,null,{"$error":"#VALUE!"},{"$error":"#VALUE!"},""]
[null,null,{"$error":"#VALUE!"},{"$error":"#VALUE!"},""]
[null,null,{"$error":"#VALUE!"},{"$error":"#VALUE!"},""]
[null,null,{"$error":"#VALUE!"},{"$error":"#VALUE!"},""]
[null,null,{"$error":"#VALUE!"},{"$error":"#VALUE!"},""]
[null,null,{"$error":"#VALUE!"},{"$error":"#VALUE!"},""]
[null,null,{"$error":"#VALUE!"},{"$error":"#VALUE!"},""]
[null,null,{"$error":"#VALUE!"},{"$error":"#VALUE!"},""]
[null,null,{"$error":"#VALUE!"},{"$error":"#VALUE!"},""]
[null,null,{"$error":"#VALUE!"},{"$error":"#VALUE!"},""]
[null,null,{"$error":"#VALUE!"},{"$error":"#VALUE!"},""]
[null,null,{"$error":"#VALUE!"},{"$error":"#VALUE!"},""]
[null,null,{"$error":"#VALUE!"},{"$error":"#VALUE!"},""]
[null,null,{"$error":"#VALUE!"},{"$error":"#VALUE!"},""]
[null,null,{"$error":"#VALUE!"},{"$error":"#VALUE!"},""]
[null,null,{"$error":"#VALUE!"},{"$error":"#VALUE!"},""]
[null,null,{"$error":"#VALUE!"},{"$error":"#VALUE!"},""]
[null,null,{"$error":"#VALUE!"},{"$error":"#VALUE!"},""]
[null,null,{"$error":"#VALUE!"},{"$error":"#VALUE!"},""]
[null,null,{"$error":"#VALUE!"},{"$error":"#VALUE!"},""]
[null,null,{"$error":"#VALUE!"},{"$error":"#VALUE!"},""]
[null,null,{"$error":"#VALUE!"},{"$error":"#VALUE!"},""]
[null,null,{"$error":"#VALUE!"},{"$error":"#VALUE!"},""]
[null,null,{"$error":"#VALUE!"},{"$error":"#VALUE!"},""]
[null,null,{"$error":"#VALUE!"},{"$error":"#VALUE!"},""]
[null,null,{"$error":"#VALUE!"},{"$error":"#VALUE!"},""]
[null,null,{"$error":"#VALUE!"},{"$error":"#VALUE!"},""]
[null,null,{"$error":"#VALUE!"},{"$error":"#VALUE!"},""]
[null,null,{"$error":"#VALUE!"},{"$error":"#VALUE!"},""]
[null,null,{"$error":"#VALUE!"},{"$error":"#VALUE!"},""]
[null,null,{"$error":"#VALUE!"},{"$error":"#VALUE!"},""]
[null,null,{"$error":"#VALUE!"},{"$error":"#VALUE!"},""]
[null,null,{"$error":"#VALUE!"},{"$error":"#VALUE!"},""]
[null,null,{"$error":"#VALUE!"},{"$error":"#VALUE!"},""]
[null,null,{"$error":"#VALUE!"},{"$error":"#VALUE!"},""]
[null,null,{"$error":"#VALUE!"},{"$error":"#VALUE!"},""]
[null,null,{"$error":"#VALUE!"},{"$error":"#VALUE!"},""]
[null,null,{"$error":"#VALUE!"},{"$error":"#VALUE!"},""]
[null,null,{"$error":"#VALUE!"},{"$error":"#VALUE!"},""]
[null,null,{"$error":"#VALUE!"},{"$error":"#VALUE!"},""]
[null,null,{"$error":"#VALUE!"},{"$error":"#VALUE!"},""]
[null,null,{"$error":"#VALUE!"},{"$error":"#VALUE!"},""]
[null,null,{"$error":"#VALUE!"},{"$error":"#VALUE!"},""]
[null,null,{"$error":"#VALUE!"},{"$error":"#VALUE!"},""]
[null,null,{"$error":"#VALUE!"},{"$error":"#VALUE!"},""]
[null,null,{"$error":"#VALUE!"},{"$error":"#VALUE!"},""]
[null,null,{"$f":"MID(A1257,FIND(\"[\",A1257)+1,999)","v":{"$error":"#VALUE!"}},{"$f":"MID(C1257,1,FIND(\"]\",C1257)-1)","v":{"$error":"#VALUE!"}},{"$f":"IFERROR(D1257,\"\")","v":""}]
[null,null,{"$error":"#VALUE!"},{"$error":"#VALUE!"},""]
[null,null,{"$error":"#VALUE!"},{"$error":"#VALUE!"},""]
[null,null,{"$error":"#VALUE!"},{"$error":"#VALUE!"},""]
[null,null,{"$error":"#VALUE!"},{"$error":"#VALUE!"},""]
[null,null,{"$error":"#VALUE!"},{"$error":"#VALUE!"},""]
[null,null,{"$error":"#VALUE!"},{"$error":"#VALUE!"},""]
[null,null,{"$error":"#VALUE!"},{"$error":"#VALUE!"},""]
[null,null,{"$error":"#VALUE!"},{"$error":"#VALUE!"},""]
[null,null,{"$error":"#VALUE!"},{"$error":"#VALUE!"},""]
[null,null,{"$error":"#VALUE!"},{"$error":"#VALUE!"},""]
[null,null,{"$error":"#VALUE!"},{"$error":"#VALUE!"},""]
[null,null,{"$error":"#VALUE!"},{"$error":"#VALUE!"},""]
[null,null,{"$error":"#VALUE!"},{"$error":"#VALUE!"},""]
[null,null,{"$error":"#VALUE!"},{"$error":"#VALUE!"},""]
[null,null,{"$error":"#VALUE!"},{"$error":"#VALUE!"},""]
[null,null,{"$error":"#VALUE!"},{"$error":"#VALUE!"},""]
[null,null,{"$error":"#VALUE!"},{"$error":"#VALUE!"},""]
[null,null,{"$error":"#VALUE!"},{"$error":"#VALUE!"},""]
[null,null,{"$error":"#VALUE!"},{"$error":"#VALUE!"},""]
[null,null,{"$error":"#VALUE!"},{"$error":"#VALUE!"},""]
[null,null,{"$error":"#VALUE!"},{"$error":"#VALUE!"},""]
[null,null,{"$error":"#VALUE!"},{"$error":"#VALUE!"},""]
[null,null,{"$error":"#VALUE!"},{"$error":"#VALUE!"},""]
[null,null,{"$error":"#VALUE!"},{"$error":"#VALUE!"},""]
[null,null,{"$error":"#VALUE!"},{"$error":"#VALUE!"},""]
[null,null,{"$error":"#VALUE!"},{"$error":"#VALUE!"},""]
[null,null,{"$error":"#VALUE!"},{"$error":"#VALUE!"},""]
[null,null,{"$error":"#VALUE!"},{"$error":"#VALUE!"},""]
[null,null,{"$error":"#VALUE!"},{"$error":"#VALUE!"},""]
[null,null,{"$error":"#VALUE!"},{"$error":"#VALUE!"},""]
[null,null,{"$error":"#VALUE!"},{"$error":"#VALUE!"},""]
[null,null,{"$error":"#VALUE!"},{"$error":"#VALUE!"},""]
[null,null,{"$error":"#VALUE!"},{"$error":"#VALUE!"},""]
[null,null,{"$error":"#VALUE!"},{"$error":"#VALUE!"},""]
[null,null,{"$error":"#VALUE!"},{"$error":"#VALUE!"},""]
[null,null,{"$error":"#VALUE!"},{"$error":"#VALUE!"},""]
[null,null,{"$error":"#VALUE!"},{"$error":"#VALUE!"},""]
[null,null,{"$error":"#VALUE!"},{"$error":"#VALUE!"},""]
[null,null,{"$error":"#VALUE!"},{"$error":"#VALUE!"},""]
[null,null,{"$error":"#VALUE!"},{"$error":"#VALUE!"},""]
[null,null,{"$error":"#VALUE!"},{"$error":"#VALUE!"},""]
[null,null,{"$error":"#VALUE!"},{"$error":"#VALUE!"},""]
[null,null,{"$error":"#VALUE!"},{"$error":"#VALUE!"},""]
[null,null,{"$error":"#VALUE!"},{"$error":"#VALUE!"},""]
[null,null,{"$error":"#VALUE!"},{"$error":"#VALUE!"},""]
[null,null,{"$error":"#VALUE!"},{"$error":"#VALUE!"},""]
[null,null,{"$error":"#VALUE!"},{"$error":"#VALUE!"},""]
[null,null,{"$error":"#VALUE!"},{"$error":"#VALUE!"},""]
[null,null,{"$error":"#VALUE!"},{"$error":"#VALUE!"},""]
[null,null,{"$error":"#VALUE!"},{"$error":"#VALUE!"},""]
[null,null,{"$error":"#VALUE!"},{"$error":"#VALUE!"},""]
[null,null,{"$error":"#VALUE!"},{"$error":"#VALUE!"},""]
[null,null,{"$error":"#VALUE!"},{"$error":"#VALUE!"},""]
[null,null,{"$error":"#VALUE!"},{"$error":"#VALUE!"},""]
[null,null,{"$error":"#VALUE!"},{"$error":"#VALUE!"},""]
[null,null,{"$error":"#VALUE!"},{"$error":"#VALUE!"},""]
[null,null,{"$error":"#VALUE!"},{"$error":"#VALUE!"},""]
[null,null,{"$error":"#VALUE!"},{"$error":"#VALUE!"},""]
[null,null,{"$error":"#VALUE!"},{"$error":"#VALUE!"},""]
[null,null,{"$error":"#VALUE!"},{"$error":"#VALUE!"},""]
[null,null,{"$error":"#VALUE!"},{"$error":"#VALUE!"},""]
[null,null,{"$error":"#VALUE!"},{"$error":"#VALUE!"},""]
[null,null,{"$error":"#VALUE!"},{"$error":"#VALUE!"},""]
[null,null,{"$f":"MID(A1321,FIND(\"[\",A1321)+1,999)","v":{"$error":"#VALUE!"}},{"$f":"MID(C1321,1,FIND(\"]\",C1321)-1)","v":{"$error":"#VALUE!"}},{"$f":"IFERROR(D1321,\"\")","v":""}]

{"sheet":"Version 1.1","index":2,"n_rows":5,"n_cols":3,"rows_kept":5,"cut":false,"hidden":false,"merged":[]}
[]
[null,"Version 1.1","2024-04-04"]
[null,null,"minimal Changes (just visual), Split for \"Realtime\" and \"Grid\""]
[null,"Version 1.0","2023-05-25"]
[null,null,"initial Version"]